{"text_format":"1","workbook":"xlsx","n_sheets":6,"sheets":["GENERALIDADES","ALCANCE 1","ALCANCE 2","ALCANCE 3","EVS","FACTORES DE EMISIÓN "],"not_rendered":{"charts":2,"images":6,"macros":1,"external_links":3,"defined_names":54,"comments":2,"pivot_tables":0},"unopened":[],"bounds":{"document_bytes":16777216,"sheet_cells":100000,"rows_first":2000,"rows_last":500,"rows_between":2000,"halvings":0,"cell_chars":16384,"cell_head_chars":4096},"cells_cut":0,"cells_raw":0,"read":"whole","date_system":"1900"}

{"sheet":"GENERALIDADES","index":0,"n_rows":44,"n_cols":11,"rows_kept":44,"cut":false,"hidden":false,"merged":[[42,0,42,2],[43,0,43,2],[42,3,42,5],[43,3,43,5],[42,10,42,12],[43,10,43,12],[5,7,5,8],[4,9,4,12],[5,9,5,12],[7,0,7,12],[36,3,36,8],[9,0,9,11],[12,3,12,8],[4,0,4,2],[4,3,4,6],[4,7,4,8],[5,0,5,2],[5,3,5,6],[42,6,42,9],[43,6,43,9],[0,0,0,3],[0,4,0,12],[2,0,2,11],[3,0,3,2],[3,3,3,6],[3,7,3,8],[3,9,3,12]]}
[null,null,null,null,"CÁLCULO DE HUELLA DE CARBONO - RAMA JUDICIAL "]
[]
[]
["SECCIONAL",null,null,null,null,null,null,"NIT"]
["DIRECCIÓN",null,null,null,null,null,null,"CÓDIGO CIIU"]
["AÑO BASE",null,null,null,null,null,null,"TELÉFONO"]
[]
["Describa cuales son los límites organizacionales que incluirán el cálculo de las emisiones de Gases Efecto Invernadero (GEI):\n\n"]
[]
["A continuación se presentan los resultados de la cuantificación de las emisiones por cada uno de los alcances, para los años reportados por la organización."]
[]
[]
[null,null,null,"CUANTIFICACIÓN ANUAL TONELADAS DE CO2 "]
[null,null,null,"AÑO",{"$f":"+'ALCANCE 1'!A4","v":2017},{"$f":"+'ALCANCE 1'!A19","v":2018},{"$f":"+'ALCANCE 1'!A33","v":2019},{"$f":"+'ALCANCE 1'!A47","v":2020},{"$f":"+'ALCANCE 1'!A61","v":2021}]
[null,null,null,"ALCANCE 1",{"$f":"+'ALCANCE 1'!W17+'ALCANCE 1'!W93","v":0},{"$f":"+'ALCANCE 1'!W31+'ALCANCE 1'!W112","v":0},{"$f":"+'ALCANCE 1'!W45+'ALCANCE 1'!W131","v":0},{"$f":"+'ALCANCE 1'!W59+'ALCANCE 1'!W150","v":0},{"$f":"+'ALCANCE 1'!W73+'ALCANCE 1'!W169","v":0}]
[null,null,null,"ALCANCE 2",{"$f":"+'ALCANCE 2'!T21","v":0},{"$f":"+'ALCANCE 2'!T23","v":0},{"$f":"+'ALCANCE 2'!T25","v":0},{"$f":"+'ALCANCE 2'!T27","v":2.1000000000000001E-2},{"$f":"+'ALCANCE 2'!T29","v":7.553E-2}]
[null,null,null,"ALCANCE 3",{"$f":"+'ALCANCE 3'!$V$19+'ALCANCE 3'!$V$102+'ALCANCE 3'!$V$158+'ALCANCE 3'!$V$217","v":62.459762328000011},{"$f":"+'ALCANCE 3'!$V$37+'ALCANCE 3'!$V$113+'ALCANCE 3'!$V$170+'ALCANCE 3'!$V$228","v":183.20826767399998},{"$f":"+'ALCANCE 3'!$V$55+'ALCANCE 3'!$V$124+'ALCANCE 3'!$V$182+'ALCANCE 3'!$V$239","v":1.1539137179999999},{"$f":"+'ALCANCE 3'!$V$73+'ALCANCE 3'!$V$135+'ALCANCE 3'!$V$194+'ALCANCE 3'!$V$250","v":1.266745},{"$f":"+'ALCANCE 3'!$V$91+'ALCANCE 3'!$V$146+'ALCANCE 3'!$V$206+'ALCANCE 3'!$V$261","v":0.98609993600000001}]
[null,null,null,"EVS ",{"$f":"+EVS!AB1553","v":46.253059799999996}]
[null,null,null,"TOTAL",{"$f":"SUM(E15:E17)","v":62.459762328000011},{"$f":"SUM(F15:F17)","v":183.20826767399998},{"$f":"SUM(G15:G17)","v":1.1539137179999999},{"$f":"SUM(H15:H17)","v":1.2877449999999999},{"$f":"SUM(I15:I17)","v":1.0616299360000001}]
[]
[]
[]
[]
[]
[]
[]
[]
[]
[]
[]
[]
[]
[]
[]
[]
[]
[null,null,null,"CUANTIFICACIÓN ANUAL  POR PILARES DE EVS "]
[null,null,null,"AÑO",{"$f":"+EVS!A2","v":2016}]
[null,null,null,"VIVIENDA ",{"$f":"+EVS!I1553+EVS!O1553+EVS!Q1553","v":1059.4933999999998}]
[null,null,null,"TRANSPORTE ",{"$f":"+EVS!T1553","v":192.52424999999988}]
[null,null,null,"ALIMENTACIÓN ",{"$f":"+EVS!V1553+EVS!X1553","v":2089.404}]
[]
["CÓDIGO\nF-EVSG-31",null,null,"ELABORÓ\nLÍDER DEL PROCESO ",null,null,"REVISÓ\nCENDOJ – SIGCMA ",null,null,null,"APROBÓ\nCOMITÉ NACIONAL DEL SIGCMA"]
["VERSIÓN\n01",null,null,"FECHA\n15/12/2019",null,null,"FECHA\n02/02/2020",null,null,null,"FECHA\n18/02/2020"]

{"sheet":"ALCANCE 1","index":1,"n_rows":169,"n_cols":23,"rows_kept":169,"cut":false,"hidden":false,"merged":[[168,1,168,21],[162,21,164,21],[162,22,164,22],[165,1,167,1],[165,2,167,2],[165,3,167,3],[165,4,167,4],[165,19,167,19],[165,20,167,20],[165,21,167,21],[165,22,167,22],[162,1,164,1],[162,2,164,2],[162,3,164,3],[162,4,164,4],[162,19,164,19],[162,20,164,20],[156,20,158,20],[156,21,158,21],[156,22,158,22],[159,1,161,1],[159,2,161,2],[159,3,161,3],[159,4,161,4],[159,19,161,19],[159,20,161,20],[159,21,161,21],[159,22,161,22],[151,23,152,23],[153,1,155,1],[153,2,155,2],[153,3,155,3],[153,4,155,4],[153,19,155,19],[153,20,155,20],[153,21,155,21],[153,22,155,22],[146,22,148,22],[149,1,149,21],[151,0,168,0],[151,1,152,1],[151,2,152,2],[151,3,152,3],[151,4,152,4],[151,5,152,5],[151,6,151,18],[146,1,148,1],[146,2,148,2],[146,3,148,3],[146,4,148,4],[146,19,148,19],[146,20,148,20],[151,19,152,19],[151,20,152,20],[151,21,152,21],[151,22,152,22],[156,1,158,1],[156,2,158,2],[156,3,158,3],[156,4,158,4],[156,19,158,19],[137,22,139,22],[140,21,142,21],[140,22,142,22],[143,1,145,1],[143,2,145,2],[143,3,145,3],[143,4,145,4],[143,19,145,19],[143,20,145,20],[143,21,145,21],[143,22,145,22],[140,1,142,1],[140,2,142,2],[140,3,142,3],[140,4,142,4],[140,19,142,19],[140,20,142,20],[132,22,133,22],[132,23,133,23],[134,1,136,1],[134,2,136,2],[134,3,136,3],[134,4,136,4],[134,19,136,19],[134,20,136,20],[134,21,136,21],[134,22,136,22],[130,1,130,21],[132,0,149,0],[132,1,133,1],[132,2,133,2],[132,3,133,3],[132,4,133,4],[132,5,133,5],[132,6,132,18],[132,19,133,19],[132,20,133,20],[132,21,133,21],[137,1,139,1],[137,2,139,2],[137,3,139,3],[137,4,139,4],[137,19,139,19],[137,20,139,20],[137,21,139,21],[146,21,148,21],[124,21,126,21],[124,22,126,22],[127,1,129,1],[127,2,129,2],[127,3,129,3],[127,4,129,4],[127,19,129,19],[127,20,129,20],[127,21,129,21],[127,22,129,22],[124,1,126,1],[124,2,126,2],[124,3,126,3],[124,4,126,4],[124,19,126,19],[124,20,126,20],[118,19,120,19],[118,20,120,20],[118,21,120,21],[118,22,120,22],[121,1,123,1],[121,2,123,2],[121,3,123,3],[121,4,123,4],[121,19,123,19],[121,20,123,20],[121,21,123,21],[121,22,123,22],[113,23,114,23],[115,1,117,1],[115,2,117,2],[115,3,117,3],[115,4,117,4],[115,19,117,19],[115,20,117,20],[115,21,117,21],[115,22,117,22],[108,21,110,21],[108,22,110,22],[111,1,111,21],[113,0,130,0],[113,1,114,1],[113,2,114,2],[113,3,114,3],[113,4,114,4],[113,5,114,5],[113,6,113,18],[108,1,110,1],[108,2,110,2],[108,3,110,3],[108,4,110,4],[108,19,110,19],[108,20,110,20],[113,19,114,19],[113,20,114,20],[113,21,114,21],[113,22,114,22],[118,1,120,1],[118,2,120,2],[118,3,120,3],[118,4,120,4],[105,2,107,2],[105,3,107,3],[105,4,107,4],[105,19,107,19],[105,20,107,20],[105,21,107,21],[105,22,107,22],[102,1,104,1],[102,2,104,2],[102,3,104,3],[102,4,104,4],[102,19,104,19],[102,20,104,20],[94,23,95,23],[96,1,98,1],[96,2,98,2],[96,3,98,3],[96,4,98,4],[96,19,98,19],[96,20,98,20],[96,21,98,21],[96,22,98,22],[92,1,92,21],[93,0,93,22],[94,0,111,0],[94,1,95,1],[94,2,95,2],[94,3,95,3],[94,4,95,4],[94,5,95,5],[94,6,94,18],[94,19,95,19],[94,20,95,20],[94,21,95,21],[94,22,95,22],[99,1,101,1],[99,2,101,2],[99,3,101,3],[99,4,101,4],[99,19,101,19],[99,20,101,20],[99,21,101,21],[99,22,101,22],[102,21,104,21],[102,22,104,22],[105,1,107,1],[89,1,91,1],[89,2,91,2],[89,3,91,3],[89,4,91,4],[89,19,91,19],[89,20,91,20],[89,21,91,21],[89,22,91,22],[86,1,88,1],[86,2,88,2],[86,3,88,3],[86,4,88,4],[86,19,88,19],[86,20,88,20],[83,21,85,21],[83,22,85,22],[80,1,82,1],[80,2,82,2],[80,3,82,3],[80,4,82,4],[80,19,82,19],[80,20,82,20],[86,21,88,21],[86,22,88,22],[75,23,76,23],[77,1,79,1],[77,2,79,2],[77,3,79,3],[77,4,79,4],[77,19,79,19],[77,20,79,20],[77,21,79,21],[77,22,79,22],[75,5,76,5],[75,6,75,18],[75,19,76,19],[75,20,76,20],[75,21,76,21],[75,22,76,22],[70,21,71,21],[70,22,71,22],[72,1,72,21],[73,0,73,22],[74,0,74,22],[75,0,92,0],[75,1,76,1],[75,2,76,2],[75,3,76,3],[75,4,76,4],[70,1,71,1],[70,2,71,2],[70,3,71,3],[70,4,71,4],[70,19,71,19],[70,20,71,20],[80,21,82,21],[80,22,82,22],[83,1,85,1],[83,2,85,2],[83,3,85,3],[83,4,85,4],[83,19,85,19],[83,20,85,20],[66,21,67,21],[66,22,67,22],[68,1,69,1],[68,2,69,2],[68,3,69,3],[68,4,69,4],[68,19,69,19],[68,20,69,20],[68,21,69,21],[68,22,69,22],[66,1,67,1],[66,2,67,2],[66,3,67,3],[66,4,67,4],[66,19,67,19],[66,20,67,20],[64,1,65,1],[64,2,65,2],[64,3,65,3],[64,4,65,4],[64,19,65,19],[64,20,65,20],[64,21,65,21],[64,22,65,22],[62,1,63,1],[62,2,63,2],[62,3,63,3],[62,4,63,4],[62,19,63,19],[62,20,63,20],[60,6,60,18],[60,19,61,19],[60,20,61,20],[60,21,61,21],[60,22,61,22],[60,23,61,23],[56,21,57,21],[56,22,57,22],[58,1,58,21],[59,0,59,22],[60,0,72,0],[60,1,61,1],[60,2,61,2],[60,3,61,3],[60,4,61,4],[60,5,61,5],[56,1,57,1],[56,2,57,2],[56,3,57,3],[56,4,57,4],[56,19,57,19],[56,20,57,20],[62,21,63,21],[62,22,63,22],[52,21,53,21],[52,22,53,22],[54,1,55,1],[54,2,55,2],[54,3,55,3],[54,4,55,4],[54,19,55,19],[54,20,55,20],[54,21,55,21],[54,22,55,22],[52,1,53,1],[52,2,53,2],[52,3,53,3],[52,4,53,4],[52,19,53,19],[52,20,53,20],[50,1,51,1],[50,2,51,2],[50,3,51,3],[50,4,51,4],[50,19,51,19],[50,20,51,20],[50,21,51,21],[50,22,51,22],[48,1,49,1],[48,2,49,2],[48,3,49,3],[48,4,49,4],[48,19,49,19],[48,20,49,20],[46,6,46,18],[46,19,47,19],[46,20,47,20],[46,21,47,21],[46,22,47,22],[46,23,47,23],[42,21,43,21],[42,22,43,22],[44,1,44,21],[45,0,45,22],[46,0,58,0],[46,1,47,1],[46,2,47,2],[46,3,47,3],[46,4,47,4],[46,5,47,5],[42,1,43,1],[42,2,43,2],[42,3,43,3],[42,4,43,4],[42,19,43,19],[42,20,43,20],[48,21,49,21],[48,22,49,22],[38,21,39,21],[38,22,39,22],[40,1,41,1],[40,2,41,2],[40,3,41,3],[40,4,41,4],[40,19,41,19],[40,20,41,20],[40,21,41,21],[40,22,41,22],[38,1,39,1],[38,2,39,2],[38,3,39,3],[38,4,39,4],[38,19,39,19],[38,20,39,20],[36,1,37,1],[36,2,37,2],[36,3,37,3],[36,4,37,4],[36,19,37,19],[36,20,37,20],[36,21,37,21],[36,22,37,22],[34,1,35,1],[34,2,35,2],[34,3,35,3],[34,4,35,4],[34,19,35,19],[34,20,35,20],[32,6,32,18],[32,19,33,19],[32,20,33,20],[32,21,33,21],[32,22,33,22],[32,23,33,23],[28,21,29,21],[28,22,29,22],[30,1,30,21],[31,0,31,22],[32,0,44,0],[32,1,33,1],[32,2,33,2],[32,3,33,3],[32,4,33,4],[32,5,33,5],[28,1,29,1],[28,2,29,2],[28,3,29,3],[28,4,29,4],[28,19,29,19],[28,20,29,20],[34,21,35,21],[34,22,35,22],[24,21,25,21],[24,22,25,22],[26,1,27,1],[26,2,27,2],[26,3,27,3],[26,4,27,4],[26,19,27,19],[26,20,27,20],[26,21,27,21],[26,22,27,22],[24,1,25,1],[24,2,25,2],[24,3,25,3],[24,4,25,4],[24,19,25,19],[24,20,25,20],[22,1,23,1],[22,2,23,2],[22,3,23,3],[22,4,23,4],[22,19,23,19],[22,20,23,20],[22,21,23,21],[22,22,23,22],[20,1,21,1],[20,2,21,2],[20,3,21,3],[20,4,21,4],[20,19,21,19],[20,20,21,20],[18,6,18,18],[18,19,19,19],[18,20,19,20],[18,21,19,21],[18,22,19,22],[18,23,19,23],[14,21,15,21],[14,22,15,22],[16,1,16,21],[17,0,17,22],[18,0,30,0],[18,1,19,1],[18,2,19,2],[18,3,19,3],[18,4,19,4],[18,5,19,5],[14,1,15,1],[14,2,15,2],[14,3,15,3],[14,4,15,4],[14,19,15,19],[14,20,15,20],[20,21,21,21],[20,22,21,22],[10,21,11,21],[10,22,11,22],[12,1,13,1],[12,2,13,2],[12,3,13,3],[12,4,13,4],[12,19,13,19],[12,20,13,20],[12,21,13,21],[12,22,13,22],[10,1,11,1],[10,2,11,2],[10,3,11,3],[10,4,11,4],[10,19,11,19],[10,20,11,20],[8,20,9,20],[8,21,9,21],[8,22,9,22],[6,1,7,1],[6,2,7,2],[6,3,7,3],[6,4,7,4],[6,19,7,19],[6,20,7,20],[0,0,0,5],[0,6,0,22],[3,19,4,19],[3,20,4,20],[3,21,4,21],[3,22,4,22],[3,23,4,23],[5,6,5,18],[1,0,1,22],[2,0,2,22],[3,0,16,0],[3,1,4,1],[3,2,4,2],[3,3,4,3],[3,4,4,4],[3,5,4,5],[3,6,3,18],[6,21,7,21],[6,22,7,22],[8,1,9,1],[8,2,9,2],[8,3,9,3],[8,4,9,4],[8,19,9,19]]}
[null,null,null,null,null,null,"CÁLCULO DE HUELLA DE CARBONO - RAMA JUDICIAL "]
[]
["FUENTES FIJAS"]
[2017,"TIPO DE COMBUSTIBLE / REFRIGERANTE / AISLANTE/\nEXTINTOR","NOMBRE","FUENTE DE EMISIÓN","UNIDAD","CARACTERÍSTICA","CONSUMO",null,null,null,null,null,null,null,null,null,null,null,null,"No. DE DATOS","FACTOR DE EMISIÓN ","UNIDADES","HUELLA DE CARBONO (TON CO2)"]
[null,null,null,null,null,null,"ENE","FEB","MAR","ABR","MAY","JUN","JUL","AGO","SEP","OCT","NOV","DIC","TOTAL"]
[null,"Escoja la opción que corresponda","Escoja la opción que corresponda","Escriba el nombre de la fuente de emisión","NO APLICA","NO APLICA","Digite los consumos y costos mensuales correspondientes de acuerdo al combustible escogido",null,null,null,null,null,null,null,null,null,null,null,null,"NO APLICA","NO APLICA","NO APLICA","NO APLICA"]
[null,"EXTINTOR","Extintores R-123 / HCFC-123",null,{"$f":"IFERROR(VLOOKUP(C7,'[1]FACTORES DE EMISIÓN'!$I$3:$L$80,4,0),0)","v":"kg"},"Consumo",null,null,null,null,null,null,null,null,null,null,null,null,{"$f":"SUM(G7:R7)","v":0},{"$f":"COUNT(G7:R7)","v":0},{"$f":"IFERROR(VLOOKUP(C7,'[1]FACTORES DE EMISIÓN'!$I$3:$L$80,2,0),0)","v":79},{"$f":"IFERROR(VLOOKUP(C7,'[1]FACTORES DE EMISIÓN'!$I$3:$L$80,3,0),0)","v":"kgCO2eq /kg"},{"$f":"IFERROR((S7*U7)/1000,0)","v":0}]
[null,null,null,null,null,"Costo/mes",null,null,null,null,null,null,null,null,null,null,null,null,0]
[null,"LIQUIDO","Gasolina E10 (Mezcla Comercial)","Planta eléctrica sede X",{"$f":"IFERROR(VLOOKUP(C9,'[1]FACTORES DE EMISIÓN'!$I$3:$L$80,4,0),0)","v":"gal"},"Consumo",null,null,null,null,null,null,null,null,null,null,null,null,0,{"$f":"COUNT(G9:R9)","v":0},{"$f":"IFERROR(VLOOKUP(C9,'[1]FACTORES DE EMISIÓN'!$I$3:$L$80,2,0),0)","v":7.6200412000000002},{"$f":"IFERROR(VLOOKUP(C9,'[1]FACTORES DE EMISIÓN'!$I$3:$L$80,3,0),0)","v":"kgCO2eq/gal"},{"$f":"IFERROR((S9*U9)/1000,0)","v":0}]
[null,null,null,null,null,"Costo/mes",null,null,null,null,null,null,null,null,null,null,null,null,0]
[null,"GAS","Gas natural Genérico","Antorcha Palacio de Justicia ",{"$f":"IFERROR(VLOOKUP(C11,'[1]FACTORES DE EMISIÓN'!$I$3:$L$80,4,0),0)","v":"m3"},"Consumo",null,null,null,null,null,null,null,null,null,null,null,null,0,{"$f":"COUNT(G11:R11)","v":0},{"$f":"IFERROR(VLOOKUP(C11,'[1]FACTORES DE EMISIÓN'!$I$3:$L$80,2,0),0)","v":1.9819536},{"$f":"IFERROR(VLOOKUP(C11,'[1]FACTORES DE EMISIÓN'!$I$3:$L$80,3,0),0)","v":"kgCO2eq /m3"},{"$f":"IFERROR((S11*U11)/1000,0)","v":0}]
[null,null,null,null,null,"Costo/mes",null,null,null,null,null,null,null,null,null,null,null,null,0]
[null,"REFRIGERANTE","HFC-23 / R-23",null,{"$f":"IFERROR(VLOOKUP(C13,'[1]FACTORES DE EMISIÓN'!$I$3:$L$80,4,0),0)","v":"kg"},"Consumo",null,null,null,null,null,null,null,",",null,null,null,null,0,{"$f":"COUNT(G13:R13)","v":0},{"$f":"IFERROR(VLOOKUP(C13,'[1]FACTORES DE EMISIÓN'!$I$3:$L$80,2,0),0)","v":12400},{"$f":"IFERROR(VLOOKUP(C13,'[1]FACTORES DE EMISIÓN'!$I$3:$L$80,3,0),0)","v":"kgCO2eq /kg"},{"$f":"IFERROR((S13*U13)/1000,0)","v":0}]
[null,null,null,null,null,"Costo/mes",null,null,null,null,null,null,null,null,null,null,null,null,0]
[null,"EXTINTOR","Extintores CO2",null,{"$f":"IFERROR(VLOOKUP(C15,'[1]FACTORES DE EMISIÓN'!$I$3:$L$80,4,0),0)","v":"kg"},"Consumo",null,null,null,null,null,null,null,null,null,null,null,null,0,{"$f":"COUNT(G15:R15)","v":0},{"$f":"IFERROR(VLOOKUP(C15,'[1]FACTORES DE EMISIÓN'!$I$3:$L$80,2,0),0)","v":1},{"$f":"IFERROR(VLOOKUP(C15,'[1]FACTORES DE EMISIÓN'!$I$3:$L$80,3,0),0)","v":"kgCO2eq /kg"},{"$f":"IFERROR((S15*U15)/1000,0)","v":0}]
[null,null,null,null,null,"Costo/mes",null,null,null,null,null,null,null,null,null,null,null,null,0]
[null,"TOTAL EMISIONES FUENTES FIJAS ",null,null,null,null,null,null,null,null,null,null,null,null,null,null,null,null,null,null,null,null,{"$f":"SUM(W7:W16)","v":0}]
[]
[2018,"TIPO DE COMBUSTIBLE / REFRIGERANTE / AISLANTE/\nEXTINTOR","NOMBRE","FUENTE DE EMISIÓN","UNIDAD","CARACTERÍSTICA","CONSUMO",null,null,null,null,null,null,null,null,null,null,null,null,"No. DE DATOS","FACTOR DE EMISIÓN ","UNIDADES","HUELLA DE CARBONO (TON CO2)"]
[null,null,null,null,null,null,"ENE","FEB","MAR","ABR","MAY","JUN","JUL","AGO","SEP","OCT","NOV","DIC","TOTAL"]
[null,"GAS","Gas natural Genérico",null,{"$f":"IFERROR(VLOOKUP(C21,'[1]FACTORES DE EMISIÓN'!$I$3:$L$80,4,0),0)","v":"m3"},"Consumo",null,null,null,null,null,null,null,null,null,null,null,null,{"$f":"SUM(G21:R21)","v":0},{"$f":"COUNT(G21:R21)","v":0},{"$f":"IFERROR(VLOOKUP(C21,'[1]FACTORES DE EMISIÓN'!$I$3:$L$80,2,0),0)","v":1.9819536},{"$f":"IFERROR(VLOOKUP(C21,'[1]FACTORES DE EMISIÓN'!$I$3:$L$80,3,0),0)","v":"kgCO2eq /m3"},{"$f":"IFERROR((S21*U21)/1000,0)","v":0}]
[null,null,null,null,null,"Costo/mes",null,null,null,null,null,null,null,null,null,null,null,null,0]
[null,"SOLIDO","Biogás Genérico",null,{"$f":"IFERROR(VLOOKUP(C23,'[1]FACTORES DE EMISIÓN'!$I$3:$L$80,4,0),0)","v":"m3"},"Consumo",null,null,null,null,null,null,null,null,null,null,null,null,0,{"$f":"COUNT(G23:R23)","v":0},{"$f":"IFERROR(VLOOKUP(C23,'[1]FACTORES DE EMISIÓN'!$I$3:$L$80,2,0),0)","v":1.857199},{"$f":"IFERROR(VLOOKUP(C23,'[1]FACTORES DE EMISIÓN'!$I$3:$L$80,3,0),0)","v":"kgCO2eq/m3"},{"$f":"IFERROR((S23*U23)/1000,0)","v":0}]
[null,null,null,null,null,"Costo/mes",null,null,null,null,null,null,null,null,null,null,null,null,0]
[null,"REFRIGERANTE","HFC-23 / R-23",null,{"$f":"IFERROR(VLOOKUP(C25,'[1]FACTORES DE EMISIÓN'!$I$3:$L$80,4,0),0)","v":"kg"},"Consumo",null,null,null,null,null,null,null,null,null,null,null,null,0,{"$f":"COUNT(G25:R25)","v":0},{"$f":"IFERROR(VLOOKUP(C25,'[1]FACTORES DE EMISIÓN'!$I$3:$L$80,2,0),0)","v":12400},{"$f":"IFERROR(VLOOKUP(C25,'[1]FACTORES DE EMISIÓN'!$I$3:$L$80,3,0),0)","v":"kgCO2eq /kg"},{"$f":"IFERROR((S25*U25)/1000,0)","v":0}]
[null,null,null,null,null,"Costo/mes",null,null,null,null,null,null,null,null,null,null,null,null,0]
[null,"AISLANTE","SF6",null,{"$f":"IFERROR(VLOOKUP(C27,'[1]FACTORES DE EMISIÓN'!$I$3:$L$80,4,0),0)","v":"kg"},"Consumo",null,null,null,null,null,null,null,",",null,null,null,null,0,{"$f":"COUNT(G27:R27)","v":0},{"$f":"IFERROR(VLOOKUP(C27,'[1]FACTORES DE EMISIÓN'!$I$3:$L$80,2,0),0)","v":23500},{"$f":"IFERROR(VLOOKUP(C27,'[1]FACTORES DE EMISIÓN'!$I$3:$L$80,3,0),0)","v":"kgCO2eq /kg"},{"$f":"IFERROR((S27*U27)/1000,0)","v":0}]
[null,null,null,null,null,"Costo/mes",null,null,null,null,null,null,null,null,null,null,null,null,0]
[null,"EXTINTOR","Extintores R-123 / HCFC-123",null,{"$f":"IFERROR(VLOOKUP(C29,'[1]FACTORES DE EMISIÓN'!$I$3:$L$80,4,0),0)","v":"kg"},"Consumo",null,null,null,null,null,null,null,null,null,null,null,null,0,{"$f":"COUNT(G29:R29)","v":0},{"$f":"IFERROR(VLOOKUP(C29,'[1]FACTORES DE EMISIÓN'!$I$3:$L$80,2,0),0)","v":79},{"$f":"IFERROR(VLOOKUP(C29,'[1]FACTORES DE EMISIÓN'!$I$3:$L$80,3,0),0)","v":"kgCO2eq /kg"},{"$f":"IFERROR((S29*U29)/1000,0)","v":0}]
[null,null,null,null,null,"Costo/mes",null,null,null,null,null,null,null,null,null,null,null,null,0]
[null,"TOTAL EMISIONES FUENTES FIJAS ",null,null,null,null,null,null,null,null,null,null,null,null,null,null,null,null,null,null,null,null,{"$f":"SUM(W21:W30)","v":0}]
[]
[2019,"TIPO DE COMBUSTIBLE / REFRIGERANTE / AISLANTE/\nEXTINTOR","NOMBRE","FUENTE DE EMISIÓN","UNIDAD","CARACTERÍSTICA","CONSUMO",null,null,null,null,null,null,null,null,null,null,null,null,"No. DE DATOS","FACTOR DE EMISIÓN ","UNIDADES","HUELLA DE CARBONO (TON CO2)"]
[null,null,null,null,null,null,"ENE","FEB","MAR","ABR","MAY","JUN","JUL","AGO","SEP","OCT","NOV","DIC","TOTAL"]
[null,"SOLIDO","Gas natural Genérico",null,{"$f":"IFERROR(VLOOKUP(C35,'[1]FACTORES DE EMISIÓN'!$I$3:$L$80,4,0),0)","v":"m3"},"Consumo",null,null,null,null,null,null,null,null,null,null,null,null,{"$f":"SUM(G35:R35)","v":0},{"$f":"COUNT(G35:R35)","v":0},{"$f":"IFERROR(VLOOKUP(C35,'[1]FACTORES DE EMISIÓN'!$I$3:$L$80,2,0),0)","v":1.9819536},{"$f":"IFERROR(VLOOKUP(C35,'[1]FACTORES DE EMISIÓN'!$I$3:$L$80,3,0),0)","v":"kgCO2eq /m3"},{"$f":"IFERROR((S35*U35)/1000,0)","v":0}]
[null,null,null,null,null,"Costo/mes",null,null,null,null,null,null,null,null,null,null,null,null,0]
[null,"GAS","Gas Natural Usme",null,{"$f":"IFERROR(VLOOKUP(C37,'[1]FACTORES DE EMISIÓN'!$I$3:$L$80,4,0),0)","v":"m3"},"Consumo",null,null,null,null,null,null,null,null,null,null,null,null,0,{"$f":"COUNT(G37:R37)","v":0},{"$f":"IFERROR(VLOOKUP(C37,'[1]FACTORES DE EMISIÓN'!$I$3:$L$80,2,0),0)","v":2.1030248999999999},{"$f":"IFERROR(VLOOKUP(C37,'[1]FACTORES DE EMISIÓN'!$I$3:$L$80,3,0),0)","v":"kgCO2eq/m3"},{"$f":"IFERROR((S37*U37)/1000,0)","v":0}]
[null,null,null,null,null,"Costo/mes",null,null,null,null,null,null,null,null,null,null,null,null,0]
[null,"REFRIGERANTE","HFC-23 / R-23",null,{"$f":"IFERROR(VLOOKUP(C39,'[1]FACTORES DE EMISIÓN'!$I$3:$L$80,4,0),0)","v":"kg"},"Consumo",null,null,null,null,null,null,null,null,null,null,null,null,0,{"$f":"COUNT(G39:R39)","v":0},{"$f":"IFERROR(VLOOKUP(C39,'[1]FACTORES DE EMISIÓN'!$I$3:$L$80,2,0),0)","v":12400},{"$f":"IFERROR(VLOOKUP(C39,'[1]FACTORES DE EMISIÓN'!$I$3:$L$80,3,0),0)","v":"kgCO2eq /kg"},{"$f":"IFERROR((S39*U39)/1000,0)","v":0}]
[null,null,null,null,null,"Costo/mes",null,null,null,null,null,null,null,null,null,null,null,null,0]
[null,"AISLANTE","SF6",null,{"$f":"IFERROR(VLOOKUP(C41,'[1]FACTORES DE EMISIÓN'!$I$3:$L$80,4,0),0)","v":"kg"},"Consumo",null,null,null,null,null,null,null,",",null,null,null,null,0,{"$f":"COUNT(G41:R41)","v":0},{"$f":"IFERROR(VLOOKUP(C41,'[1]FACTORES DE EMISIÓN'!$I$3:$L$80,2,0),0)","v":23500},{"$f":"IFERROR(VLOOKUP(C41,'[1]FACTORES DE EMISIÓN'!$I$3:$L$80,3,0),0)","v":"kgCO2eq /kg"},{"$f":"IFERROR((S41*U41)/1000,0)","v":0}]
[null,null,null,null,null,"Costo/mes",null,null,null,null,null,null,null,null,null,null,null,null,0]
[null,"EXTINTOR","Extintores R-123 / HCFC-123",null,{"$f":"IFERROR(VLOOKUP(C43,'[1]FACTORES DE EMISIÓN'!$I$3:$L$80,4,0),0)","v":"kg"},"Consumo",null,null,null,null,null,null,null,null,null,null,null,null,0,{"$f":"COUNT(G43:R43)","v":0},{"$f":"IFERROR(VLOOKUP(C43,'[1]FACTORES DE EMISIÓN'!$I$3:$L$80,2,0),0)","v":79},{"$f":"IFERROR(VLOOKUP(C43,'[1]FACTORES DE EMISIÓN'!$I$3:$L$80,3,0),0)","v":"kgCO2eq /kg"},{"$f":"IFERROR((S43*U43)/1000,0)","v":0}]
[null,null,null,null,null,"Costo/mes",null,null,null,null,null,null,null,null,null,null,null,null,0]
[null,"TOTAL EMISIONES FUENTES FIJAS ",null,null,null,null,null,null,null,null,null,null,null,null,null,null,null,null,null,null,null,null,{"$f":"SUM(W35:W44)","v":0}]
[]
[2020,"TIPO DE COMBUSTIBLE / REFRIGERANTE / AISLANTE/\nEXTINTOR","NOMBRE","FUENTE DE EMISIÓN","UNIDAD","CARACTERÍSTICA","CONSUMO",null,null,null,null,null,null,null,null,null,null,null,null,"No. DE DATOS","FACTOR DE EMISIÓN ","UNIDADES","HUELLA DE CARBONO (TON CO2)"]
[null,null,null,null,null,null,"ENE","FEB","MAR","ABR","MAY","JUN","JUL","AGO","SEP","OCT","NOV","DIC","TOTAL"]
[null,"SOLIDO","Gas natural Genérico",null,{"$f":"IFERROR(VLOOKUP(C49,'[1]FACTORES DE EMISIÓN'!$I$3:$L$80,4,0),0)","v":"m3"},"Consumo",null,null,null,null,null,null,null,null,null,null,null,null,{"$f":"SUM(G49:R49)","v":0},{"$f":"COUNT(G49:R49)","v":0},{"$f":"IFERROR(VLOOKUP(C49,'[1]FACTORES DE EMISIÓN'!$I$3:$L$80,2,0),0)","v":1.9819536},{"$f":"IFERROR(VLOOKUP(C49,'[1]FACTORES DE EMISIÓN'!$I$3:$L$80,3,0),0)","v":"kgCO2eq /m3"},{"$f":"IFERROR((S49*U49)/1000,0)","v":0}]
[null,null,null,null,null,"Costo/mes",null,null,null,null,null,null,null,null,null,null,null,null,0]
[null,"GAS","Gas Natural Usme",null,{"$f":"IFERROR(VLOOKUP(C51,'[1]FACTORES DE EMISIÓN'!$I$3:$L$80,4,0),0)","v":"m3"},"Consumo",null,null,null,null,null,null,null,null,null,null,null,null,0,{"$f":"COUNT(G51:R51)","v":0},{"$f":"IFERROR(VLOOKUP(C51,'[1]FACTORES DE EMISIÓN'!$I$3:$L$80,2,0),0)","v":2.1030248999999999},{"$f":"IFERROR(VLOOKUP(C51,'[1]FACTORES DE EMISIÓN'!$I$3:$L$80,3,0),0)","v":"kgCO2eq/m3"},{"$f":"IFERROR((S51*U51)/1000,0)","v":0}]
[null,null,null,null,null,"Costo/mes",null,null,null,null,null,null,null,null,null,null,null,null,0]
[null,"REFRIGERANTE","HFC-23 / R-23",null,{"$f":"IFERROR(VLOOKUP(C53,'[1]FACTORES DE EMISIÓN'!$I$3:$L$80,4,0),0)","v":"kg"},"Consumo",null,null,null,null,null,null,null,null,null,null,null,null,0,{"$f":"COUNT(G53:R53)","v":0},{"$f":"IFERROR(VLOOKUP(C53,'[1]FACTORES DE EMISIÓN'!$I$3:$L$80,2,0),0)","v":12400},{"$f":"IFERROR(VLOOKUP(C53,'[1]FACTORES DE EMISIÓN'!$I$3:$L$80,3,0),0)","v":"kgCO2eq /kg"},{"$f":"IFERROR((S53*U53)/1000,0)","v":0}]
[null,null,null,null,null,"Costo/mes",null,null,null,null,null,null,null,null,null,null,null,null,0]
[null,"AISLANTE","SF6",null,{"$f":"IFERROR(VLOOKUP(C55,'[1]FACTORES DE EMISIÓN'!$I$3:$L$80,4,0),0)","v":"kg"},"Consumo",null,null,null,null,null,null,null,",",null,null,null,null,0,{"$f":"COUNT(G55:R55)","v":0},{"$f":"IFERROR(VLOOKUP(C55,'[1]FACTORES DE EMISIÓN'!$I$3:$L$80,2,0),0)","v":23500},{"$f":"IFERROR(VLOOKUP(C55,'[1]FACTORES DE EMISIÓN'!$I$3:$L$80,3,0),0)","v":"kgCO2eq /kg"},{"$f":"IFERROR((S55*U55)/1000,0)","v":0}]
[null,null,null,null,null,"Costo/mes",null,null,null,null,null,null,null,null,null,null,null,null,0]
[null,"EXTINTOR","Extintores R-123 / HCFC-123",null,{"$f":"IFERROR(VLOOKUP(C57,'[1]FACTORES DE EMISIÓN'!$I$3:$L$80,4,0),0)","v":"kg"},"Consumo",null,null,null,null,null,null,null,null,null,null,null,null,0,{"$f":"COUNT(G57:R57)","v":0},{"$f":"IFERROR(VLOOKUP(C57,'[1]FACTORES DE EMISIÓN'!$I$3:$L$80,2,0),0)","v":79},{"$f":"IFERROR(VLOOKUP(C57,'[1]FACTORES DE EMISIÓN'!$I$3:$L$80,3,0),0)","v":"kgCO2eq /kg"},{"$f":"IFERROR((S57*U57)/1000,0)","v":0}]
[null,null,null,null,null,"Costo/mes",null,null,null,null,null,null,null,null,null,null,null,null,0]
[null,"TOTAL EMISIONES FUENTES FIJAS ",null,null,null,null,null,null,null,null,null,null,null,null,null,null,null,null,null,null,null,null,{"$f":"SUM(W49:W58)","v":0}]
[]
[2021,"TIPO DE COMBUSTIBLE / REFRIGERANTE / AISLANTE/\nEXTINTOR","NOMBRE","FUENTE DE EMISIÓN","UNIDAD","CARACTERÍSTICA","CONSUMO",null,null,null,null,null,null,null,null,null,null,null,null,"No. DE DATOS","FACTOR DE EMISIÓN ","UNIDADES","HUELLA DE CARBONO (TON CO2)"]
[null,null,null,null,null,null,"ENE","FEB","MAR","ABR","MAY","JUN","JUL","AGO","SEP","OCT","NOV","DIC","TOTAL"]
[null,"SOLIDO","Carbón genérico",null,{"$f":"IFERROR(VLOOKUP(C63,'[1]FACTORES DE EMISIÓN'!$I$3:$L$80,4,0),0)","v":"kg"},"Consumo",null,null,null,null,null,null,null,null,null,null,null,null,{"$f":"SUM(G63:R63)","v":0},{"$f":"COUNT(G63:R63)","v":0},{"$f":"IFERROR(VLOOKUP(C63,'[1]FACTORES DE EMISIÓN'!$I$3:$L$80,2,0),0)","v":2547.0504916},{"$f":"IFERROR(VLOOKUP(C63,'[1]FACTORES DE EMISIÓN'!$I$3:$L$80,3,0),0)","v":"kgCO2eq/kg"},{"$f":"IFERROR((S63*U63)/1000,0)","v":0}]
[null,null,null,null,null,"Costo/mes",null,null,null,null,null,null,null,null,null,null,null,null,0]
[null,"GAS","Biogás Genérico",null,{"$f":"IFERROR(VLOOKUP(C65,'[1]FACTORES DE EMISIÓN'!$I$3:$L$80,4,0),0)","v":"m3"},"Consumo",null,null,null,null,null,null,null,null,null,null,null,null,0,{"$f":"COUNT(G65:R65)","v":0},{"$f":"IFERROR(VLOOKUP(C65,'[1]FACTORES DE EMISIÓN'!$I$3:$L$80,2,0),0)","v":1.857199},{"$f":"IFERROR(VLOOKUP(C65,'[1]FACTORES DE EMISIÓN'!$I$3:$L$80,3,0),0)","v":"kgCO2eq/m3"},{"$f":"IFERROR((S65*U65)/1000,0)","v":0}]
[null,null,null,null,null,"Costo/mes",null,null,null,null,null,null,null,null,null,null,null,null,0]
[null,"REFRIGERANTE","HFC-23 / R-23",null,{"$f":"IFERROR(VLOOKUP(C67,'[1]FACTORES DE EMISIÓN'!$I$3:$L$80,4,0),0)","v":"kg"},"Consumo",null,null,null,null,null,null,null,null,null,null,null,null,0,{"$f":"COUNT(G67:R67)","v":0},{"$f":"IFERROR(VLOOKUP(C67,'[1]FACTORES DE EMISIÓN'!$I$3:$L$80,2,0),0)","v":12400},{"$f":"IFERROR(VLOOKUP(C67,'[1]FACTORES DE EMISIÓN'!$I$3:$L$80,3,0),0)","v":"kgCO2eq /kg"},{"$f":"IFERROR((S67*U67)/1000,0)","v":0}]
[null,null,null,null,null,"Costo/mes",null,null,null,null,null,null,null,null,null,null,null,null,0]
[null,"AISLANTE","SF6",null,{"$f":"IFERROR(VLOOKUP(C69,'[1]FACTORES DE EMISIÓN'!$I$3:$L$80,4,0),0)","v":"kg"},"Consumo",null,null,null,null,null,null,null,",",null,null,null,null,0,{"$f":"COUNT(G69:R69)","v":0},{"$f":"IFERROR(VLOOKUP(C69,'[1]FACTORES DE EMISIÓN'!$I$3:$L$80,2,0),0)","v":23500},{"$f":"IFERROR(VLOOKUP(C69,'[1]FACTORES DE EMISIÓN'!$I$3:$L$80,3,0),0)","v":"kgCO2eq /kg"},{"$f":"IFERROR((S69*U69)/1000,0)","v":0}]
[null,null,null,null,null,"Costo/mes",null,null,null,null,null,null,null,null,null,null,null,null,0]
[null,"EXTINTOR","Extintores R-123 / HCFC-123",null,{"$f":"IFERROR(VLOOKUP(C71,'[1]FACTORES DE EMISIÓN'!$I$3:$L$80,4,0),0)","v":"kg"},"Consumo",null,null,null,null,null,null,null,null,null,null,null,null,0,{"$f":"COUNT(G71:R71)","v":0},{"$f":"IFERROR(VLOOKUP(C71,'[1]FACTORES DE EMISIÓN'!$I$3:$L$80,2,0),0)","v":79},{"$f":"IFERROR(VLOOKUP(C71,'[1]FACTORES DE EMISIÓN'!$I$3:$L$80,3,0),0)","v":"kgCO2eq /kg"},{"$f":"IFERROR((S71*U71)/1000,0)","v":0}]
[null,null,null,null,null,"Costo/mes",null,null,null,null,null,null,null,null,null,null,null,null,0]
[null,"TOTAL EMISIONES FUENTES FIJAS ",null,null,null,null,null,null,null,null,null,null,null,null,null,null,null,null,null,null,null,null,{"$f":"SUM(W63:W72)","v":0}]
[]
["FUENTES MÓVILES"]
[2017,"TIPO DE COMBUSTIBLE / REFRIGERANTE / AISLANTE/\nEXTINTOR","NOMBRE","FUENTE DE EMISIÓN","UNIDAD","CARACTERÍSTICA","CONSUMO",null,null,null,null,null,null,null,null,null,null,null,null,"No. DE DATOS","FACTOR DE EMISIÓN ","UNIDADES","HUELLA DE CARBONO (TON CO2)"]
[null,null,null,null,null,null,"ENE","FEB","MAR","ABR","MAY","JUN","JUL","AGO","SEP","OCT","NOV","DIC","TOTAL"]
[null,"REFRIGERANTE","Isobutano / R-600A ",null,{"$f":"IFERROR(VLOOKUP(C78,'[1]FACTORES DE EMISIÓN'!$N$3:$Q$46,4,0),0)","v":"kg"},"Consumo",null,null,null,null,null,null,null,null,null,null,null,null,{"$f":"SUM(G78:R78)","v":0},{"$f":"COUNT(G78:R78)","v":0},{"$f":"IFERROR(VLOOKUP(C78,'[1]FACTORES DE EMISIÓN'!$N$3:$Q$46,2,0),0)","v":1},{"$f":"IFERROR(VLOOKUP(C78,'[1]FACTORES DE EMISIÓN'!$N$3:$Q$46,3,0),0)","v":"kgCO2eq/kg"},{"$f":"IFERROR((S78*U78)/1000,0)","v":0}]
[null,null,null,null,null,"km/mes",null,null,null,null,null,null,null,null,null,null,null,null,{"$f":"SUM(G79:R79)","v":0}]
[null,null,null,null,null,"Costo/mes",null,null,null,null,null,null,null,null,null,null,null,null,{"$f":"SUM(G80:R80)","v":0}]
[null,"GAS","Biogás Genérico",null,{"$f":"IFERROR(VLOOKUP(C81,'[1]FACTORES DE EMISIÓN'!$I$3:$L$80,4,0),0)","v":"m3"},"Consumo",null,null,null,null,null,null,null,null,null,null,null,null,0,{"$f":"COUNT(G81:R81)","v":0},{"$f":"IFERROR(VLOOKUP(C81,'[1]FACTORES DE EMISIÓN'!$I$3:$L$80,2,0),0)","v":1.857199},{"$f":"IFERROR(VLOOKUP(C81,'[1]FACTORES DE EMISIÓN'!$I$3:$L$80,3,0),0)","v":"kgCO2eq/m3"},{"$f":"IFERROR((S81*U81)/1000,0)","v":0}]
[null,null,null,null,null,"km/mes",null,null,null,null,null,null,null,null,null,null,null,null,0]
[null,null,null,null,null,"Costo/mes",null,null,null,null,null,null,null,null,null,null,null,null,0]
[null,"SOLIDO","Carbón Guajira Cesar",null,{"$f":"IFERROR(VLOOKUP(C84,'[1]FACTORES DE EMISIÓN'!$I$3:$L$80,4,0),0)","v":"kg"},"Consumo",null,null,null,null,null,null,null,null,null,null,null,null,0,{"$f":"COUNT(G84:R84)","v":0},{"$f":"IFERROR(VLOOKUP(C84,'[1]FACTORES DE EMISIÓN'!$I$3:$L$80,2,0),0)","v":2172.0828047},{"$f":"IFERROR(VLOOKUP(C84,'[1]FACTORES DE EMISIÓN'!$I$3:$L$80,3,0),0)","v":"kgCO2eq/kg"},{"$f":"IFERROR((S84*U84)/1000,0)","v":0}]
[null,null,null,null,null,"km/mes",null,null,null,null,null,null,null,null,null,null,null,null,0]
[null,null,null,null,null,"Costo/mes",null,null,null,null,null,null,null,null,null,null,null,null,0]
[null,"GAS","Gas natural Genérico",null,{"$f":"IFERROR(VLOOKUP(C87,'[1]FACTORES DE EMISIÓN'!$I$3:$L$80,4,0),0)","v":"m3"},"Consumo",null,null,null,null,null,null,null,",",null,null,null,null,0,{"$f":"COUNT(G87:R87)","v":0},{"$f":"IFERROR(VLOOKUP(C87,'[1]FACTORES DE EMISIÓN'!$I$3:$L$80,2,0),0)","v":1.9819536},{"$f":"IFERROR(VLOOKUP(C87,'[1]FACTORES DE EMISIÓN'!$I$3:$L$80,3,0),0)","v":"kgCO2eq /m3"},{"$f":"IFERROR((S87*U87)/1000,0)","v":0}]
[null,null,null,null,null,"km/mes",null,null,null,null,null,null,null,null,null,null,null,null,0]
[null,null,null,null,null,"Costo/mes",null,null,null,null,null,null,null,null,null,null,null,null,0]
[null,null,null,null,{"$f":"IFERROR(VLOOKUP(C90,'[1]FACTORES DE EMISIÓN'!$I$3:$L$80,4,0),0)","v":0},"Consumo",null,null,null,null,null,null,null,null,null,null,null,null,0,{"$f":"COUNT(G90:R90)","v":0},{"$f":"IFERROR(VLOOKUP(C90,'[1]FACTORES DE EMISIÓN'!$I$3:$L$80,2,0),0)","v":0},{"$f":"IFERROR(VLOOKUP(C90,'[1]FACTORES DE EMISIÓN'!$I$3:$L$80,3,0),0)","v":0},{"$f":"IFERROR((S90*U90)/1000,0)","v":0}]
[null,null,null,null,null,"km/mes",null,null,null,null,null,null,null,null,null,null,null,null,0]
[null,null,null,null,null,"Costo/mes",null,null,null,null,null,null,null,null,null,null,null,null,0]
[null,"TOTAL EMISIONES FUENTES MÓVILES",null,null,null,null,null,null,null,null,null,null,null,null,null,null,null,null,null,null,null,null,{"$f":"SUM(W78:W92)","v":0}]
[]
[2018,"TIPO DE COMBUSTIBLE / REFRIGERANTE / AISLANTE/\nEXTINTOR","NOMBRE","FUENTE DE EMISIÓN","UNIDAD","CARACTERÍSTICA","CONSUMO",null,null,null,null,null,null,null,null,null,null,null,null,"No. DE DATOS","FACTOR DE EMISIÓN ","UNIDADES","HUELLA DE CARBONO (TON CO2)"]
[null,null,null,null,null,null,"ENE","FEB","MAR","ABR","MAY","JUN","JUL","AGO","SEP","OCT","NOV","DIC","TOTAL"]
[null,"REFRIGERANTE","Propano Alta Calidad / R-290",null,{"$f":"IFERROR(VLOOKUP(C97,'[1]FACTORES DE EMISIÓN'!$N$3:$Q$46,4,0),0)","v":"kg"},"Consumo",null,null,null,null,null,null,null,null,null,null,null,null,{"$f":"SUM(G97:R97)","v":0},{"$f":"COUNT(G97:R97)","v":0},{"$f":"IFERROR(VLOOKUP(C97,'[1]FACTORES DE EMISIÓN'!$N$3:$Q$46,2,0),0)","v":3},{"$f":"IFERROR(VLOOKUP(C97,'[1]FACTORES DE EMISIÓN'!$N$3:$Q$46,3,0),0)","v":"kgCO2eq/kg"},{"$f":"IFERROR((S97*U97)/1000,0)","v":0}]
[null,null,null,null,null,"km/mes",null,null,null,null,null,null,null,null,null,null,null,null,0]
[null,null,null,null,null,"Costo/mes",null,null,null,null,null,null,null,null,null,null,null,null,0]
[null,"REFRIGERANTE","Propano Alta Calidad / R-290",null,{"$f":"IFERROR(VLOOKUP(C100,'[1]FACTORES DE EMISIÓN'!$N$3:$Q$46,4,0),0)","v":"kg"},"Consumo",null,null,null,null,null,null,null,null,null,null,null,null,0,{"$f":"COUNT(G100:R100)","v":0},{"$f":"IFERROR(VLOOKUP(C100,'[1]FACTORES DE EMISIÓN'!$N$3:$Q$46,2,0),0)","v":3},{"$f":"IFERROR(VLOOKUP(C100,'[1]FACTORES DE EMISIÓN'!$N$3:$Q$46,3,0),0)","v":"kgCO2eq/kg"},{"$f":"IFERROR((S100*U100)/1000,0)","v":0}]
[null,null,null,null,null,"km/mes",null,null,null,null,null,null,null,null,null,null,null,null,0]
[null,null,null,null,null,"Costo/mes",null,null,null,null,null,null,null,null,null,null,null,null,0]
[null,"REFRIGERANTE","Propano Alta Calidad / R-290",null,{"$f":"IFERROR(VLOOKUP(C103,'[1]FACTORES DE EMISIÓN'!$N$3:$Q$46,4,0),0)","v":"kg"},"Consumo",null,null,null,null,null,null,null,null,null,null,null,null,0,{"$f":"COUNT(G103:R103)","v":0},{"$f":"IFERROR(VLOOKUP(C103,'[1]FACTORES DE EMISIÓN'!$N$3:$Q$46,2,0),0)","v":3},{"$f":"IFERROR(VLOOKUP(C103,'[1]FACTORES DE EMISIÓN'!$N$3:$Q$46,3,0),0)","v":"kgCO2eq/kg"},{"$f":"IFERROR((S103*U103)/1000,0)","v":0}]
[null,null,null,null,null,"km/mes",null,null,null,null,null,null,null,null,null,null,null,null,0]
[null,null,null,null,null,"Costo/mes",null,null,null,null,null,null,null,null,null,null,null,null,0]
[null,"SOLIDO","Carbón Guajira Cesar",null,{"$f":"IFERROR(VLOOKUP(C106,'[1]FACTORES DE EMISIÓN'!$I$3:$L$80,4,0),0)","v":"kg"},"Consumo",null,null,null,null,null,null,null,",",null,null,null,null,0,{"$f":"COUNT(G106:R106)","v":0},{"$f":"IFERROR(VLOOKUP(C106,'[1]FACTORES DE EMISIÓN'!$I$3:$L$80,2,0),0)","v":2172.0828047},{"$f":"IFERROR(VLOOKUP(C106,'[1]FACTORES DE EMISIÓN'!$I$3:$L$80,3,0),0)","v":"kgCO2eq/kg"},{"$f":"IFERROR((S106*U106)/1000,0)","v":0}]
[null,null,null,null,null,"km/mes",null,null,null,null,null,null,null,null,null,null,null,null,0]
[null,null,null,null,null,"Costo/mes",null,null,null,null,null,null,null,null,null,null,null,null,0]
[null,"LIQUIDO","Combustóleo",null,{"$f":"IFERROR(VLOOKUP(C109,'[1]FACTORES DE EMISIÓN'!$I$3:$L$80,4,0),0)","v":"gal"},"Consumo",null,null,null,null,null,null,null,null,null,null,null,null,0,{"$f":"COUNT(G109:R109)","v":0},{"$f":"IFERROR(VLOOKUP(C109,'[1]FACTORES DE EMISIÓN'!$I$3:$L$80,2,0),0)","v":11.627035599999999},{"$f":"IFERROR(VLOOKUP(C109,'[1]FACTORES DE EMISIÓN'!$I$3:$L$80,3,0),0)","v":"kgCO2eq/gal"},{"$f":"IFERROR((S109*U109)/1000,0)","v":0}]
[null,null,null,null,null,"km/mes",null,null,null,null,null,null,null,null,null,null,null,null,0]
[null,null,null,null,null,"Costo/mes",null,null,null,null,null,null,null,null,null,null,null,null,0]
[null,"TOTAL EMISIONES FUENTES MÓVILES",null,null,null,null,null,null,null,null,null,null,null,null,null,null,null,null,null,null,null,null,{"$f":"SUM(W97:W111)","v":0}]
[]
[2019,"TIPO DE COMBUSTIBLE / REFRIGERANTE / AISLANTE/\nEXTINTOR","NOMBRE","FUENTE DE EMISIÓN","UNIDAD","CARACTERÍSTICA","CONSUMO",null,null,null,null,null,null,null,null,null,null,null,null,"No. DE DATOS","FACTOR DE EMISIÓN ","UNIDADES","HUELLA DE CARBONO (TON CO2)"]
[null,null,null,null,null,null,"ENE","FEB","MAR","ABR","MAY","JUN","JUL","AGO","SEP","OCT","NOV","DIC","TOTAL"]
[null,"GAS","Biogás Genérico",null,{"$f":"IFERROR(VLOOKUP(C116,'[1]FACTORES DE EMISIÓN'!$I$3:$L$80,4,0),0)","v":"m3"},"Consumo",null,null,null,null,null,null,null,null,null,null,null,null,{"$f":"SUM(G116:R116)","v":0},{"$f":"COUNT(G116:R116)","v":0},{"$f":"IFERROR(VLOOKUP(C116,'[1]FACTORES DE EMISIÓN'!$I$3:$L$80,2,0),0)","v":1.857199},{"$f":"IFERROR(VLOOKUP(C116,'[1]FACTORES DE EMISIÓN'!$I$3:$L$80,3,0),0)","v":"kgCO2eq/m3"},{"$f":"IFERROR((S116*U116)/1000,0)","v":0}]
[null,null,null,null,null,"km/mes",null,null,null,null,null,null,null,null,null,null,null,null,0]
[null,null,null,null,null,"Costo/mes",null,null,null,null,null,null,null,null,null,null,null,null,0]
[null,"SOLIDO","Madera Acacia",null,{"$f":"IFERROR(VLOOKUP(C119,'[1]FACTORES DE EMISIÓN'!$I$3:$L$80,4,0),0)","v":"kg"},"Consumo",null,null,null,null,null,null,null,null,null,null,null,null,0,{"$f":"COUNT(G119:R119)","v":0},{"$f":"IFERROR(VLOOKUP(C119,'[1]FACTORES DE EMISIÓN'!$I$3:$L$80,2,0),0)","v":35.518599999999999},{"$f":"IFERROR(VLOOKUP(C119,'[1]FACTORES DE EMISIÓN'!$I$3:$L$80,3,0),0)","v":"kgCO2eq/kg"},{"$f":"IFERROR((S119*U119)/1000,0)","v":0}]
[null,null,null,null,null,"km/mes",null,null,null,null,null,null,null,null,null,null,null,null,0]
[null,null,null,null,null,"Costo/mes",null,null,null,null,null,null,null,null,null,null,null,null,0]
[null,"REFRIGERANTE","Halon 1301 / CBrF3",null,{"$f":"IFERROR(VLOOKUP(C122,'[1]FACTORES DE EMISIÓN'!$I$3:$L$80,4,0),0)","v":"kg"},"Consumo",null,null,null,null,null,null,null,null,null,null,null,null,0,{"$f":"COUNT(G122:R122)","v":0},{"$f":"IFERROR(VLOOKUP(C122,'[1]FACTORES DE EMISIÓN'!$I$3:$L$80,2,0),0)","v":6290},{"$f":"IFERROR(VLOOKUP(C122,'[1]FACTORES DE EMISIÓN'!$I$3:$L$80,3,0),0)","v":"kgCO2eq /kg"},{"$f":"IFERROR((S122*U122)/1000,0)","v":0}]
[null,null,null,null,null,"km/mes",null,null,null,null,null,null,null,null,null,null,null,null,0]
[null,null,null,null,null,"Costo/mes",null,null,null,null,null,null,null,null,null,null,null,null,0]
[null,"LIQUIDOS","Jet A1",null,{"$f":"IFERROR(VLOOKUP(C125,'[1]FACTORES DE EMISIÓN'!$I$3:$L$80,4,0),0)","v":"gal"},"Consumo",null,null,null,null,null,null,null,",",null,null,null,null,0,{"$f":"COUNT(G125:R125)","v":0},{"$f":"IFERROR(VLOOKUP(C125,'[1]FACTORES DE EMISIÓN'!$I$3:$L$80,2,0),0)","v":9.8422979000000002},{"$f":"IFERROR(VLOOKUP(C125,'[1]FACTORES DE EMISIÓN'!$I$3:$L$80,3,0),0)","v":"kgCO2eq/gal"},{"$f":"IFERROR((S125*U125)/1000,0)","v":0}]
[null,null,null,null,null,"km/mes",null,null,null,null,null,null,null,null,null,null,null,null,0]
[null,null,null,null,null,"Costo/mes",null,null,null,null,null,null,null,null,null,null,null,null,0]
[null,"GAS","Biogás Genérico",null,{"$f":"IFERROR(VLOOKUP(C128,'[1]FACTORES DE EMISIÓN'!$I$3:$L$80,4,0),0)","v":"m3"},"Consumo",null,null,null,null,null,null,null,null,null,null,null,null,0,{"$f":"COUNT(G128:R128)","v":0},{"$f":"IFERROR(VLOOKUP(C128,'[1]FACTORES DE EMISIÓN'!$I$3:$L$80,2,0),0)","v":1.857199},{"$f":"IFERROR(VLOOKUP(C128,'[1]FACTORES DE EMISIÓN'!$I$3:$L$80,3,0),0)","v":"kgCO2eq/m3"},{"$f":"IFERROR((S128*U128)/1000,0)","v":0}]
[null,null,null,null,null,"km/mes",null,null,null,null,null,null,null,null,null,null,null,null,0]
[null,null,null,null,null,"Costo/mes",null,null,null,null,null,null,null,null,null,null,null,null,0]
[null,"TOTAL EMISIONES FUENTES MÓVILES",null,null,null,null,null,null,null,null,null,null,null,null,null,null,null,null,null,null,null,null,{"$f":"SUM(W116:W130)","v":0}]
[]
[2020,"TIPO DE COMBUSTIBLE / REFRIGERANTE / AISLANTE/\nEXTINTOR","NOMBRE","FUENTE DE EMISIÓN","UNIDAD","CARACTERÍSTICA","CONSUMO",null,null,null,null,null,null,null,null,null,null,null,null,"No. DE DATOS","FACTOR DE EMISIÓN ","UNIDADES","HUELLA DE CARBONO (TON CO2)"]
[null,null,null,null,null,null,"ENE","FEB","MAR","ABR","MAY","JUN","JUL","AGO","SEP","OCT","NOV","DIC","TOTAL"]
[null,"GAS","Biogás Genérico",null,{"$f":"IFERROR(VLOOKUP(C135,'[1]FACTORES DE EMISIÓN'!$I$3:$L$80,4,0),0)","v":"m3"},"Consumo",null,null,null,null,null,null,null,null,null,null,null,null,{"$f":"SUM(G135:R135)","v":0},{"$f":"COUNT(G135:R135)","v":0},{"$f":"IFERROR(VLOOKUP(C135,'[1]FACTORES DE EMISIÓN'!$I$3:$L$80,2,0),0)","v":1.857199},{"$f":"IFERROR(VLOOKUP(C135,'[1]FACTORES DE EMISIÓN'!$I$3:$L$80,3,0),0)","v":"kgCO2eq/m3"},{"$f":"IFERROR((S135*U135)/1000,0)","v":0}]
[null,null,null,null,null,"km/mes",null,null,null,null,null,null,null,null,null,null,null,null,0]
[null,null,null,null,null,"Costo/mes",null,null,null,null,null,null,null,null,null,null,null,null,0]
[null,"LIQUIDO","Combustóleo",null,{"$f":"IFERROR(VLOOKUP(C138,'[1]FACTORES DE EMISIÓN'!$I$3:$L$80,4,0),0)","v":"gal"},"Consumo",null,null,null,null,null,null,null,null,null,null,null,null,0,{"$f":"COUNT(G138:R138)","v":0},{"$f":"IFERROR(VLOOKUP(C138,'[1]FACTORES DE EMISIÓN'!$I$3:$L$80,2,0),0)","v":11.627035599999999},{"$f":"IFERROR(VLOOKUP(C138,'[1]FACTORES DE EMISIÓN'!$I$3:$L$80,3,0),0)","v":"kgCO2eq/gal"},{"$f":"IFERROR((S138*U138)/1000,0)","v":0}]
[null,null,null,null,null,"km/mes",null,null,null,null,null,null,null,null,null,null,null,null,0]
[null,null,null,null,null,"Costo/mes",null,null,null,null,null,null,null,null,null,null,null,null,0]
[null,"REFRIGERANTE","Isobutano / R-600A ",null,{"$f":"IFERROR(VLOOKUP(C141,'[1]FACTORES DE EMISIÓN'!$I$3:$L$80,4,0),0)","v":"kg"},"Consumo",null,null,null,null,null,null,null,null,null,null,null,null,0,{"$f":"COUNT(G141:R141)","v":0},{"$f":"IFERROR(VLOOKUP(C141,'[1]FACTORES DE EMISIÓN'!$I$3:$L$80,2,0),0)","v":1},{"$f":"IFERROR(VLOOKUP(C141,'[1]FACTORES DE EMISIÓN'!$I$3:$L$80,3,0),0)","v":"kgCO2eq /kg"},{"$f":"IFERROR((S141*U141)/1000,0)","v":0}]
[null,null,null,null,null,"km/mes",null,null,null,null,null,null,null,null,null,null,null,null,0]
[null,null,null,null,null,"Costo/mes",null,null,null,null,null,null,null,null,null,null,null,null,0]
[null,"SOLIDO","Carbón Guajira",null,{"$f":"IFERROR(VLOOKUP(C144,'[1]FACTORES DE EMISIÓN'!$I$3:$L$80,4,0),0)","v":"kg"},"Consumo",null,null,null,null,null,null,null,",",null,null,null,null,0,{"$f":"COUNT(G144:R144)","v":0},{"$f":"IFERROR(VLOOKUP(C144,'[1]FACTORES DE EMISIÓN'!$I$3:$L$80,2,0),0)","v":2907.0013776999999},{"$f":"IFERROR(VLOOKUP(C144,'[1]FACTORES DE EMISIÓN'!$I$3:$L$80,3,0),0)","v":"kgCO2eq/kg"},{"$f":"IFERROR((S144*U144)/1000,0)","v":0}]
[null,null,null,null,null,"km/mes",null,null,null,null,null,null,null,null,null,null,null,null,0]
[null,null,null,null,null,"Costo/mes",null,null,null,null,null,null,null,null,null,null,null,null,0]
[null,"LIQUIDOS",null,null,{"$f":"IFERROR(VLOOKUP(C147,'[1]FACTORES DE EMISIÓN'!$I$3:$L$80,4,0),0)","v":0},"Consumo",null,null,null,null,null,null,null,null,null,null,null,null,0,{"$f":"COUNT(G147:R147)","v":0},{"$f":"IFERROR(VLOOKUP(C147,'[1]FACTORES DE EMISIÓN'!$I$3:$L$80,2,0),0)","v":0},{"$f":"IFERROR(VLOOKUP(C147,'[1]FACTORES DE EMISIÓN'!$I$3:$L$80,3,0),0)","v":0},{"$f":"IFERROR((S147*U147)/1000,0)","v":0}]
[null,null,null,null,null,"km/mes",null,null,null,null,null,null,null,null,null,null,null,null,0]
[null,null,null,null,null,"Costo/mes",null,null,null,null,null,null,null,null,null,null,null,null,0]
[null,"TOTAL EMISIONES FUENTES MÓVILES",null,null,null,null,null,null,null,null,null,null,null,null,null,null,null,null,null,null,null,null,{"$f":"SUM(W135:W149)","v":0}]
[]
[2021,"TIPO DE COMBUSTIBLE / REFRIGERANTE / AISLANTE/\nEXTINTOR","NOMBRE","FUENTE DE EMISIÓN","UNIDAD","CARACTERÍSTICA","CONSUMO",null,null,null,null,null,null,null,null,null,null,null,null,"No. DE DATOS","FACTOR DE EMISIÓN ","UNIDADES","HUELLA DE CARBONO (TON CO2)"]
[null,null,null,null,null,null,"ENE","FEB","MAR","ABR","MAY","JUN","JUL","AGO","SEP","OCT","NOV","DIC","TOTAL"]
[null,"GAS","Biogás Genérico",null,{"$f":"IFERROR(VLOOKUP(C154,'[1]FACTORES DE EMISIÓN'!$I$3:$L$80,4,0),0)","v":"m3"},"Consumo",null,null,null,null,null,null,null,null,null,null,null,null,{"$f":"SUM(G154:R154)","v":0},{"$f":"COUNT(G154:R154)","v":0},{"$f":"IFERROR(VLOOKUP(C154,'[1]FACTORES DE EMISIÓN'!$I$3:$L$80,2,0),0)","v":1.857199},{"$f":"IFERROR(VLOOKUP(C154,'[1]FACTORES DE EMISIÓN'!$I$3:$L$80,3,0),0)","v":"kgCO2eq/m3"},{"$f":"IFERROR((S154*U154)/1000,0)","v":0}]
[null,null,null,null,null,"km/mes",null,null,null,null,null,null,null,null,null,null,null,null,0]
[null,null,null,null,null,"Costo/mes",null,null,null,null,null,null,null,null,null,null,null,null,0]
[null,"LIQUIDO","Jet A1",null,{"$f":"IFERROR(VLOOKUP(C157,'[1]FACTORES DE EMISIÓN'!$I$3:$L$80,4,0),0)","v":"gal"},"Consumo",null,null,null,null,null,null,null,null,null,null,null,null,0,{"$f":"COUNT(G157:R157)","v":0},{"$f":"IFERROR(VLOOKUP(C157,'[1]FACTORES DE EMISIÓN'!$I$3:$L$80,2,0),0)","v":9.8422979000000002},{"$f":"IFERROR(VLOOKUP(C157,'[1]FACTORES DE EMISIÓN'!$I$3:$L$80,3,0),0)","v":"kgCO2eq/gal"},{"$f":"IFERROR((S157*U157)/1000,0)","v":0}]
[null,null,null,null,null,"km/mes",null,null,null,null,null,null,null,null,null,null,null,null,0]
[null,null,null,null,null,"Costo/mes",null,null,null,null,null,null,null,null,null,null,null,null,0]
[null,"GAS","Gas Natural Guajira",null,{"$f":"IFERROR(VLOOKUP(C160,'[1]FACTORES DE EMISIÓN'!$I$3:$L$80,4,0),0)","v":"m3"},"Consumo",null,null,null,null,null,null,null,null,null,null,null,null,0,{"$f":"COUNT(G160:R160)","v":0},{"$f":"IFERROR(VLOOKUP(C160,'[1]FACTORES DE EMISIÓN'!$I$3:$L$80,2,0),0)","v":1.8408125},{"$f":"IFERROR(VLOOKUP(C160,'[1]FACTORES DE EMISIÓN'!$I$3:$L$80,3,0),0)","v":"kgCO2eq /m3"},{"$f":"IFERROR((S160*U160)/1000,0)","v":0}]
[null,null,null,null,null,"km/mes",null,null,null,null,null,null,null,null,null,null,null,null,0]
[null,null,null,null,null,"Costo/mes",null,null,null,null,null,null,null,null,null,null,null,null,0]
[null,"GAS","Gas natural Genérico",null,{"$f":"IFERROR(VLOOKUP(C163,'[1]FACTORES DE EMISIÓN'!$I$3:$L$80,4,0),0)","v":"m3"},"Consumo",null,null,null,null,null,null,null,",",null,null,null,null,0,{"$f":"COUNT(G163:R163)","v":0},{"$f":"IFERROR(VLOOKUP(C163,'[1]FACTORES DE EMISIÓN'!$I$3:$L$80,2,0),0)","v":1.9819536},{"$f":"IFERROR(VLOOKUP(C163,'[1]FACTORES DE EMISIÓN'!$I$3:$L$80,3,0),0)","v":"kgCO2eq /m3"},{"$f":"IFERROR((S163*U163)/1000,0)","v":0}]
[null,null,null,null,null,"km/mes",null,null,null,null,null,null,null,null,null,null,null,null,0]
[null,null,null,null,null,"Costo/mes",null,null,null,null,null,null,null,null,null,null,null,null,0]
[null,"SOLIDO","Carbón Cundinamarca ",null,{"$f":"IFERROR(VLOOKUP(C166,'[1]FACTORES DE EMISIÓN'!$I$3:$L$80,4,0),0)","v":"kg"},"Consumo",null,null,null,null,null,null,null,null,null,null,null,null,0,{"$f":"COUNT(G166:R166)","v":0},{"$f":"IFERROR(VLOOKUP(C166,'[1]FACTORES DE EMISIÓN'!$I$3:$L$80,2,0),0)","v":2226.8699200999999},{"$f":"IFERROR(VLOOKUP(C166,'[1]FACTORES DE EMISIÓN'!$I$3:$L$80,3,0),0)","v":"kgCO2eq/kg"},{"$f":"IFERROR((S166*U166)/1000,0)","v":0}]
[null,null,null,null,null,"km/mes",null,null,null,null,null,null,null,null,null,null,null,null,0]
[null,null,null,null,null,"Costo/mes",null,null,null,null,null,null,null,null,null,null,null,null,0]
[null,"TOTAL EMISIONES FUENTES MÓVILES",null,null,null,null,null,null,null,null,null,null,null,null,null,null,null,null,null,null,null,null,{"$f":"SUM(W154:W168)","v":0}]

{"sheet":"ALCANCE 2","index":2,"n_rows":30,"n_cols":20,"rows_kept":30,"cut":false,"hidden":false,"merged":[[22,18,23,18],[22,19,23,19],[28,18,29,18],[28,19,29,19],[0,1,1,4],[0,5,1,19],[26,1,27,1],[26,16,27,16],[26,17,27,17],[26,18,27,18],[26,19,27,19],[24,16,25,16],[24,17,25,17],[24,18,25,18],[24,19,25,19],[22,1,23,1],[22,16,23,16],[22,17,23,17],[24,1,25,1],[20,1,21,1],[28,1,29,1],[28,16,29,16],[28,17,29,17],[20,16,21,16],[20,17,21,17],[20,18,21,18],[20,19,21,19],[17,2,19,2],[17,3,17,19],[18,3,19,3],[18,4,19,4],[18,5,19,5],[18,6,19,6],[18,7,19,7],[18,8,19,8],[18,9,19,9],[18,16,19,16],[18,17,19,17],[18,18,19,18],[18,19,19,19],[18,10,19,10],[18,11,19,11],[18,12,19,12],[9,1,9,2],[10,1,10,2],[11,1,11,2],[12,1,12,2],[15,1,15,15],[13,1,13,2],[18,13,19,13],[18,14,19,14],[18,15,19,15],[17,1,19,1],[4,1,4,15],[6,1,6,7],[6,8,6,15],[7,1,8,2],[7,3,7,15]]}
[null,null,null,null,null,"CÁLCULO DE HUELLA DE CARBONO - RAMA JUDICIAL "]
[]
[]
[]
[null,"UNIDADES DE PRODUCCIÓN"]
[]
[null,"UNIDAD DE PRODUCCIÓN A (Ej: ton, kg, personas, etc): ",null,null,null,null,null,null,"Indique el nombre de la unidad de producción"]
[null,"AÑO\n(Escoja los años a calcular)",null,"CANTIDAD MENSUAL"]
[null,null,null,"Enero","Febrero","Marzo","Abril","Mayo","Junio","Julio","Agosto","Septiembre","Octubre","Noviembre","Diciembre","Total"]
[null,{"$f":"B21","v":2017},null,null,null,null,null,null,null,null,null,null,null,null,null,{"$f":"D10+E10+F10+G10+H10+I10+J10+K10+L10+M10+N10+O10","v":0}]
[null,{"$f":"B23","v":2018},null,null,null,null,null,null,null,null,null,null,null,null,null,{"$f":"D11+E11+F11+G11+H11+I11+J11+K11+L11+M11+N11+O11","v":0}]
[null,{"$f":"B25","v":2019},null,null,null,null,null,null,null,null,null,null,null,null,null,{"$f":"D12+E12+F12+G12+H12+I12+J12+K12+L12+M12+N12+O12","v":0}]
[null,{"$f":"B27","v":2020},null,null,null,null,null,null,null,null,null,null,null,null,null,{"$f":"D13+E13+F13+G13+H13+I13+J13+K13+L13+M13+N13+O13","v":0}]
[null,{"$f":"B29","v":2021},null,null,null,null,null,null,null,null,null,null,null,null,null,{"$f":"D14+E14+F14+G14+H14+I14+J14+K14+L14+M14+N14+O14","v":0}]
[]
[null,"ENERGÍA ELÉCTRICA ADQUIRIDA"]
[]
[null,"AÑO","CARACTERÍSTICA","ELECTRICIDAD ADQUIRIDA (kWh)"]
[null,null,null,"Enero","Febrero","Marzo","Abril","Mayo","Junio","Julio","Agosto","Septiembre","Octubre","Noviembre","Diciembre","Total (kWh)","No. DE DATOS","FACTOR DE EMISIÓN ","UNIDADES FACTOR EMISIÓN","HUELLA DE CARBONO (TON CO2)"]
[]
[null,2017,"Consumo (KWh)",null,null,null,null,null,null,null,null,null,null,null,null,{"$f":"SUM(D21:O21)","v":0},{"$f":"COUNT(D21:O21)","v":0},0.21,"Kg CO2/kWh",{"$f":" (P21*R21)/1000","v":0}]
[null,null,"Costo total mes\n (Ver factura)",null,null,null,null,null,null,null,null,null,null,null,null,0]
[null,2018,"Consumo (KWh)",null,null,null,null,null,null,null,null,null,null,null,null,0,{"$f":"COUNT(D23:O23)","v":0},0.21,"Kg CO2/kWh",{"$f":" (P23*R23)/1000","v":0}]
[null,null,"Costo total mes\n (Ver factura)",null,null,null,null,null,null,null,null,null,null,null,null,0]
[null,2019,"Consumo (KWh)",null,null,null,null,null,null,null,null,null,null,null,null,0,{"$f":"COUNT(D25:O25)","v":0},0.21,"Kg CO2/kWh",{"$f":" (P25*R25)/1000","v":0}]
[null,null,"Costo total mes\n (Ver factura)",null,null,null,null,null,null,null,null,null,null,null,null,0]
[null,2020,"Consumo (KWh)",null,null,null,null,null,null,null,null,null,null,null,100,100,{"$f":"COUNT(D27:O27)","v":1},0.21,"Kg CO2/kWh",{"$f":" (P27*R27)/1000","v":2.1000000000000001E-2}]
[null,null,"Costo total mes\n (Ver factura)",null,null,null,null,null,null,null,null,null,null,null,20,20]
[null,2021,"Consumo (KWh)",100,120,200,5,30,null,null,null,null,null,null,null,{"$f":"SUM(D29:O29)","v":455},{"$f":"COUNT(D29:O29)","v":5},0.16600000000000001,"Kg CO2/kWh",{"$f":" (P29*R29)/1000","v":7.553E-2}]
[null,null,"Costo total mes\n (Ver factura)",null,null,null,null,null,null,null,null,null,5050,200,300,{"$f":"SUM(D30:O30)","v":5550}]

{"sheet":"ALCANCE 3","index":3,"n_rows":334,"n_cols":22,"rows_kept":334,"cut":false,"hidden":false,"merged":[[0,0,0,4],[0,5,0,21],[318,21,320,21],[320,5,320,17],[321,3,321,4],[322,3,322,4],[323,3,323,4],[324,3,324,4],[318,0,326,0],[318,3,320,4],[318,5,318,17],[318,18,320,18],[318,19,320,19],[318,20,320,20],[325,3,325,4],[308,21,310,21],[310,5,310,17],[311,3,311,4],[312,3,312,4],[313,3,313,4],[314,3,314,4],[308,0,316,0],[308,3,310,4],[308,5,308,17],[308,18,310,18],[308,19,310,19],[308,20,310,20],[315,3,315,4],[298,21,300,21],[300,5,300,17],[301,3,301,4],[302,3,302,4],[303,3,303,4],[304,3,304,4],[298,0,306,0],[298,3,300,4],[298,5,298,17],[298,18,300,18],[298,19,300,19],[298,20,300,20],[305,3,305,4],[278,0,286,0],[278,3,280,4],[278,5,278,17],[278,18,280,18],[278,19,280,19],[278,20,280,20],[291,3,291,4],[292,3,292,4],[293,3,293,4],[294,3,294,4],[288,0,296,0],[295,3,295,4],[278,21,280,21],[280,5,280,17],[281,3,281,4],[282,3,282,4],[283,3,283,4],[284,3,284,4],[285,3,285,4],[288,21,290,21],[290,5,290,17],[288,3,290,4],[288,5,288,17],[288,18,290,18],[288,19,290,19],[288,20,290,20],[267,0,275,0],[267,2,268,2],[267,3,269,3],[267,4,269,4],[267,5,267,17],[267,18,269,18],[267,19,269,19],[267,20,269,20],[261,0,266,0],[269,5,269,17],[274,1,276,1],[261,1,261,2],[261,3,261,4],[262,1,262,2],[262,3,262,4],[267,21,269,21],[263,1,263,2],[263,3,263,4],[264,1,264,2],[264,3,264,4],[265,1,265,2],[265,3,265,4],[266,1,266,20],[252,20,254,20],[252,21,254,21],[254,1,254,2],[254,5,254,17],[255,1,255,2],[255,3,255,4],[252,0,260,0],[252,1,253,2],[252,3,254,4],[252,5,252,17],[252,18,254,18],[252,19,254,19],[256,1,256,2],[256,3,256,4],[257,1,257,2],[257,3,257,4],[258,1,258,2],[258,3,258,4],[259,1,259,2],[259,3,259,4],[260,1,260,20],[247,1,247,2],[247,3,247,4],[248,1,248,2],[248,3,248,4],[249,1,249,20],[251,0,251,21],[241,20,243,20],[241,21,243,21],[243,1,243,2],[243,5,243,17],[244,1,244,2],[244,3,244,4],[241,0,249,0],[241,1,242,2],[241,3,243,4],[241,5,241,17],[241,18,243,18],[241,19,243,19],[245,1,245,2],[245,3,245,4],[246,1,246,2],[246,3,246,4],[236,1,236,2],[236,3,236,4],[237,1,237,2],[237,3,237,4],[238,1,238,20],[240,0,240,21],[230,20,232,20],[230,21,232,21],[232,1,232,2],[232,5,232,17],[233,1,233,2],[233,3,233,4],[230,0,238,0],[230,1,231,2],[230,3,232,4],[230,5,230,17],[230,18,232,18],[230,19,232,19],[234,1,234,2],[234,3,234,4],[235,1,235,2],[235,3,235,4],[225,1,225,2],[225,3,225,4],[226,1,226,2],[226,3,226,4],[227,1,227,20],[229,0,229,21],[219,20,221,20],[219,21,221,21],[221,1,221,2],[221,5,221,17],[222,1,222,2],[222,3,222,4],[219,0,227,0],[219,1,220,2],[219,3,221,4],[219,5,219,17],[219,18,221,18],[219,19,221,19],[223,1,223,2],[223,3,223,4],[224,1,224,2],[224,3,224,4],[214,1,214,2],[214,3,214,4],[215,1,215,2],[215,3,215,4],[216,1,216,20],[218,0,218,21],[208,20,210,20],[208,21,210,21],[210,1,210,2],[210,5,210,17],[211,1,211,2],[211,3,211,4],[208,0,216,0],[208,1,209,2],[208,3,210,4],[208,5,208,17],[208,18,210,18],[208,19,210,19],[212,1,212,2],[212,3,212,4],[213,1,213,2],[213,3,213,4],[197,18,199,18],[197,19,199,19],[197,20,199,20],[197,21,199,21],[199,5,199,17],[207,0,207,21],[185,19,187,19],[185,20,187,20],[185,21,187,21],[187,5,187,17],[196,0,196,21],[197,0,205,0],[197,2,198,2],[197,3,199,3],[197,4,199,4],[197,5,197,17],[185,0,193,0],[185,2,186,2],[185,3,187,3],[185,4,187,4],[185,5,185,17],[185,18,187,18],[173,18,175,18],[173,19,175,19],[173,20,175,20],[173,21,175,21],[175,5,175,17],[184,0,184,21],[161,19,163,19],[161,20,163,20],[161,21,163,21],[163,5,163,17],[172,0,172,21],[173,0,181,0],[173,2,174,2],[173,3,175,3],[173,4,175,4],[173,5,173,17],[161,0,169,0],[161,2,162,2],[161,3,163,3],[161,4,163,4],[161,5,161,17],[161,18,163,18],[149,19,151,19],[149,20,151,20],[149,21,151,21],[151,5,151,17],[152,22,153,22],[160,0,160,21],[149,0,157,0],[149,2,150,2],[149,3,151,3],[149,4,151,4],[149,5,149,17],[149,18,151,18],[137,21,139,21],[139,0,145,0],[139,1,139,2],[139,5,139,17],[145,2,145,20],[148,0,148,21],[136,0,136,21],[137,0,138,0],[137,1,138,1],[137,2,138,2],[137,3,139,3],[137,4,139,4],[137,5,137,17],[137,18,139,18],[137,19,139,19],[137,20,139,20],[126,18,128,18],[126,19,128,19],[126,20,128,20],[126,21,128,21],[128,0,134,0],[128,1,128,2],[128,5,128,17],[134,2,134,20],[126,0,127,0],[126,1,127,1],[126,2,127,2],[126,3,128,3],[126,4,128,4],[126,5,126,17],[115,21,117,21],[117,0,123,0],[117,1,117,2],[117,5,117,17],[123,2,123,20],[125,0,125,21],[114,0,114,21],[115,0,116,0],[115,1,116,1],[115,2,116,2],[115,3,117,3],[115,4,117,4],[115,5,115,17],[115,18,117,18],[115,19,117,19],[115,20,117,20],[104,18,106,18],[104,19,106,19],[104,20,106,20],[104,21,106,21],[106,0,112,0],[106,1,106,2],[106,5,106,17],[112,2,112,20],[96,22,97,22],[101,2,101,20],[102,0,102,21],[103,0,103,21],[104,0,105,0],[104,1,105,1],[104,2,105,2],[104,3,106,3],[104,4,106,4],[104,5,104,17],[84,21,86,21],[93,19,95,19],[93,20,95,20],[93,21,95,21],[95,0,101,0],[95,1,95,2],[95,5,95,17],[90,1,90,2],[90,3,90,20],[92,0,92,21],[93,0,94,0],[93,1,94,1],[93,2,94,2],[93,3,95,3],[93,4,95,4],[93,5,93,17],[93,18,95,18],[76,22,77,22],[77,0,89,0],[77,1,77,2],[77,5,77,17],[78,1,80,2],[78,3,80,3],[78,19,80,19],[78,20,80,20],[78,21,80,21],[86,22,87,22],[87,1,89,2],[87,3,89,3],[87,19,89,19],[87,20,89,20],[87,21,89,21],[81,1,83,2],[81,3,83,3],[81,19,83,19],[81,20,83,20],[81,21,83,21],[84,1,86,2],[84,3,86,3],[84,19,86,19],[84,20,86,20],[74,0,74,21],[75,0,76,0],[75,1,76,2],[75,3,77,3],[75,4,77,4],[75,5,75,17],[75,18,77,18],[75,19,77,19],[75,20,77,20],[75,21,77,21],[72,1,72,2],[72,3,72,20],[64,22,65,22],[66,1,68,2],[66,3,68,3],[66,19,68,19],[66,20,68,20],[66,21,68,21],[73,0,73,21],[59,0,71,0],[57,18,59,18],[57,19,59,19],[57,20,59,20],[57,21,59,21],[69,1,71,2],[69,3,71,3],[69,19,71,19],[69,20,71,20],[69,21,71,21],[59,1,59,2],[59,5,59,17],[60,1,62,2],[60,3,62,3],[60,19,62,19],[43,22,44,22],[45,1,47,2],[45,3,47,3],[45,19,47,19],[45,20,47,20],[45,21,47,21],[60,20,62,20],[60,21,62,21],[63,1,65,2],[63,3,65,3],[63,19,65,19],[63,20,65,20],[63,21,65,21],[53,22,54,22],[54,1,54,2],[54,3,54,20],[55,0,55,21],[56,0,56,21],[57,0,58,0],[57,1,58,2],[57,3,59,3],[57,4,59,4],[57,5,57,17],[41,0,53,0],[42,1,44,2],[42,3,44,3],[42,19,44,19],[42,20,44,20],[51,3,53,3],[51,19,53,19],[51,20,53,20],[51,21,53,21],[42,21,44,21],[48,1,50,2],[48,3,50,3],[48,19,50,19],[48,20,50,20],[48,21,50,21],[51,1,53,2],[36,1,36,2],[36,3,36,20],[37,0,37,21],[38,0,38,21],[39,0,40,0],[39,1,40,2],[39,3,41,3],[39,4,41,4],[39,5,39,17],[39,18,41,18],[39,19,41,19],[39,20,41,20],[39,21,41,21],[41,1,41,2],[41,5,41,17],[21,19,23,19],[21,20,23,20],[21,21,23,21],[30,1,32,2],[30,3,32,3],[30,19,32,19],[30,20,32,20],[30,21,32,21],[33,1,35,2],[33,3,35,3],[33,19,35,19],[33,20,35,20],[33,21,35,21],[21,22,22,22],[23,0,35,0],[23,1,23,2],[23,5,23,17],[24,1,26,2],[24,3,26,3],[24,19,26,19],[18,1,18,2],[18,3,18,20],[19,0,19,21],[20,0,20,21],[21,0,22,0],[21,1,22,2],[21,3,23,3],[21,4,23,4],[21,5,21,17],[21,18,23,18],[24,20,26,20],[24,21,26,21],[27,1,29,2],[27,3,29,3],[27,19,29,19],[27,20,29,20],[27,21,29,21],[3,22,4,22],[12,1,14,2],[12,3,14,3],[12,19,14,19],[12,20,14,20],[12,21,14,21],[15,1,17,2],[15,3,17,3],[15,19,17,19],[15,20,17,20],[15,21,17,21],[5,0,17,0],[5,1,5,2],[5,5,5,17],[6,1,8,2],[6,3,8,3],[6,19,8,19],[6,20,8,20],[1,0,1,21],[2,0,2,21],[3,0,4,0],[3,1,4,2],[3,3,5,3],[3,4,5,4],[3,5,3,17],[3,18,5,18],[3,19,5,19],[6,21,8,21],[9,1,11,2],[9,3,11,3],[9,19,11,19],[9,20,11,20],[9,21,11,21],[3,20,5,20],[3,21,5,21]]}
[null,null,null,null,null,"CÁLCULO DE HUELLA DE CARBONO - RAMA JUDICIAL "]
[]
["TRANSPORTE URBANO "]
[2017,"MODO DE TRANSPORTE",null,"CAPACIDAD DE CARGA ","UNIDAD","Km recorridos , número de usuarios y huella de carbono por  mes ",null,null,null,null,null,null,null,null,null,null,null,null,"No. DE DATOS","FACTOR DE EMISIÓN ","UNIDADES DEL FACTOR","HUELLA DE CARBONO (TON CO2 eq)"]
[null,null,null,null,null,"ENE","FEB","MAR","ABR","MAY","JUN","JUL","AGO","SEP","OCT","NOV","DIC","TOTAL"]
[null,"Escoja la opción que corresponda",null,null,null,"Digite la cantidad de Km recorridos por mes y el número de usuarios por cada tipo de transporte "]
[null,"Vehículo propio TWC;>1400c.c ",null,{"$f":"+VLOOKUP(B7,'[1]FACTORES DE EMISIÓN'!$BV$5:$BY$8,4,FALSE)","v":1},"km recorridos ",3500,3500,3500,3500,3500,3500,3500,3500,3500,3500,3500,3500,{"$f":"SUM(F7:Q7)","v":42000},{"$f":"COUNT(F7:Q7)","v":12},{"$f":"IFERROR(VLOOKUP(B7,'[1]FACTORES DE EMISIÓN'!$BV$5:$BX$8,3,0),0)","v":218},"g/km",{"$f":"+((R7*T7)/D7)/1000000","v":9.1560000000000006}]
[null,null,null,null,"N° usuarios ",3,3,null,null,null,null,null,null,null,null,null,null,{"$f":"SUM(F8:Q8)","v":6},{"$f":"COUNT(F8:Q8)","v":2}]
[null,null,null,null,"Huella (g Co2 eq)",{"$f":"+((F7*$T$7)/D7)","v":763000},{"$f":"+((G7*$T$7)/$D$7)","v":763000},{"$f":"+((H7*$T$7)/$D$7)","v":763000},763000,763000,763000,763000,763000,763000,763000,763000,763000,{"$f":"SUM(F9:Q9)","v":9156000},12]
[null,"Motocicleta 4 tiempos ",null,{"$f":"+VLOOKUP(B10,'[1]FACTORES DE EMISIÓN'!$BV$5:$BY$8,4,FALSE)","v":1},"km recorridos ",2552,424,null,null,null,null,null,null,null,null,null,null,{"$f":"SUM(F10:Q10)","v":2976},2,{"$f":"IFERROR(VLOOKUP(B10,'[1]FACTORES DE EMISIÓN'!$BV$5:$BX$8,3,0),0)","v":33.11},"g/km",{"$f":"+((R10*T10)/D10)/1000000","v":9.8535360000000002E-2}]
[null,null,null,null,"N° usuarios ",5,1,null,null,null,null,null,null,null,null,null,null,6,2]
[null,null,null,null,"Huella (g Co2 eq)",{"$f":"+((F10*$T$10)/$D$10)","v":84496.72},{"$f":"+((G10*$T$10)/$D$10)","v":14038.64},{"$f":"+((H10*$T$10)/$D$10)","v":0},0,0,0,0,0,0,0,0,0,98535.360000000001,12]
[null,"Vehículo propio TWC;>1400c.c ",null,{"$f":"+VLOOKUP(B13,'[1]FACTORES DE EMISIÓN'!$BV$5:$BY$8,4,FALSE)","v":1},"km recorridos ",2304,2304,2304,2304,2304,2304,2304,2304,2304,2304,2304,2304,27648,12,{"$f":"IFERROR(VLOOKUP(B13,'[1]FACTORES DE EMISIÓN'!$BV$5:$BX$8,3,0),0)","v":218},"g/km",{"$f":"+((R13*T13)/D13)/1000000","v":6.0272639999999997}]
[null,null,null,null,"N° usuarios ",3,1,null,null,null,null,null,null,null,null,null,null,4,2]
[null,null,null,null,"Huella (g Co2 eq)",{"$f":"+((F13*$T$13)/$D$13)","v":502272},{"$f":"+((G13*$T$13)/$D$13)","v":502272},502272,502272,502272,502272,502272,502272,502272,502272,502272,502272,{"$f":"SUM(F15:Q15)","v":6027264},12]
[null,"SITP <6000 c.c.",null,{"$f":"+VLOOKUP(B16,'[1]FACTORES DE EMISIÓN'!$BV$5:$BY$8,4,FALSE)","v":40},"km recorridos ",1752,1752,1752,1752,1752,1752,1752,1752,1752,1752,1752,1752,21024,12,{"$f":"IFERROR(VLOOKUP(B16,'[1]FACTORES DE EMISIÓN'!$BV$5:$BX$8,3,0),0)","v":787.03},"g/km",{"$f":"+((R16*T16)/D16)/1000000","v":0.41366296800000002}]
[null,null,null,null,"N° usuarios ",2,8,null,null,null,null,null,null,null,null,null,null,10,2]
[null,null,null,null,"Huella (g Co2 eq)",{"$f":"+((F16*$T$16)/$D$16)","v":34471.914000000004},{"$f":"+((G16*$T$16)/$D$16)","v":34471.914000000004},34471.914000000004,34471.914000000004,34471.914000000004,34471.914000000004,34471.914000000004,34471.914000000004,34471.914000000004,34471.914000000004,34471.914000000004,34471.914000000004,{"$f":"SUM(F18:Q18)","v":413662.96799999994},12]
[null,"TOTAL EMISIONES ",null,null,null,null,null,null,null,null,null,null,null,null,null,null,null,null,null,null,null,{"$f":"+SUM(V7:V17)","v":15.695462328000001}]
[]
["TRANSPORTE URBANO "]
[2018,"MODO DE TRANSPORTE",null,"CAPACIDAD DE CARGA ","UNIDAD","Km recorridos , número de usuarios y huella de carbono por  mes ",null,null,null,null,null,null,null,null,null,null,null,null,"No. DE DATOS","FACTOR DE EMISIÓN ","UNIDADES DEL FACTOR","HUELLA DE CARBONO (TON CO2 eq)"]
[null,null,null,null,null,"ENE","FEB","MAR","ABR","MAY","JUN","JUL","AGO","SEP","OCT","NOV","DIC","TOTAL"]
[null,"Escoja la opción que corresponda",null,null,null,"Digite la cantidad de Km recorridos por mes y el número de usuarios por cada tipo de transporte "]
[null,"Transmilenio",null,{"$f":"+VLOOKUP(B25,'[1]FACTORES DE EMISIÓN'!$BV$5:$BY$8,4,FALSE)","v":140},"km recorridos ",1128,1960,null,null,null,null,null,null,null,null,null,null,{"$f":"SUM(F25:Q25)","v":3088},{"$f":"COUNT(F25:Q25)","v":2},{"$f":"IFERROR(VLOOKUP(B25,'[1]FACTORES DE EMISIÓN'!$BV$5:$BX$8,3,0),0)","v":685.16},"g/km",{"$f":"+((R25*T25)/D25)/1000000","v":1.5112672000000001E-2}]
[null,null,null,null,"N° usuarios ",3,3,null,null,null,null,null,null,null,null,null,null,{"$f":"SUM(F26:Q26)","v":6},{"$f":"COUNT(F26:Q26)","v":2}]
[null,null,null,null,"Huella (g Co2 eq)",{"$f":"+((F25*$T$25)/$D$25)","v":5520.4319999999998},{"$f":"+((G25*$T$25)/$D$25)","v":9592.24},0,0,0,0,0,0,0,0,0,0,{"$f":"SUM(F27:Q27)","v":15112.671999999999},12]
[null,"Motocicleta 4 tiempos ",null,{"$f":"+VLOOKUP(B28,'[1]FACTORES DE EMISIÓN'!$BV$5:$BY$8,4,FALSE)","v":1},"km recorridos ",2552,424,null,null,null,null,null,null,null,null,null,null,{"$f":"SUM(F28:Q28)","v":2976},2,{"$f":"IFERROR(VLOOKUP(B28,'[1]FACTORES DE EMISIÓN'!$BV$5:$BX$8,3,0),0)","v":33.11},"g/km",{"$f":"+((R28*T28)/D28)/1000000","v":9.8535360000000002E-2}]
[null,null,null,null,"N° usuarios ",5,1,null,null,null,null,null,null,null,null,null,null,6,2]
[null,null,null,null,"Huella (g Co2 eq)",{"$f":"+((F28*$T$28)/$D$28)","v":84496.72},{"$f":"+((G28*$T$28)/$D$28)","v":14038.64},0,0,0,0,0,0,0,0,0,0,98535.360000000001,12]
[null,"Vehículo propio TWC;>1400c.c ",null,{"$f":"+VLOOKUP(B31,'[1]FACTORES DE EMISIÓN'!$BV$5:$BY$8,4,FALSE)","v":1},"km recorridos ",2304,768,null,null,null,null,null,null,null,null,null,null,3072,2,{"$f":"IFERROR(VLOOKUP(B31,'[1]FACTORES DE EMISIÓN'!$BV$5:$BX$8,3,0),0)","v":218},"g/km",{"$f":"+((R31*T31)/D31)/1000000","v":0.66969599999999996}]
[null,null,null,null,"N° usuarios ",3,1,null,null,null,null,null,null,null,null,null,null,4,2]
[null,null,null,null,"Huella (g Co2 eq)",{"$f":"+((F31*$T$31)/$D$31)","v":502272},{"$f":"+((G31*$T$31)/$D$31)","v":167424},0,0,0,0,0,0,0,0,0,0,{"$f":"SUM(F33:Q33)","v":669696},12]
[null,"SITP <6000 c.c.",null,{"$f":"+VLOOKUP(B34,'[1]FACTORES DE EMISIÓN'!$BV$5:$BY$8,4,FALSE)","v":40},"km recorridos ",752,1704,null,null,null,null,null,null,null,null,null,null,{"$f":"SUM(F34:Q34)","v":2456},2,{"$f":"IFERROR(VLOOKUP(B34,'[1]FACTORES DE EMISIÓN'!$BV$5:$BX$8,3,0),0)","v":787.03},"g/km",{"$f":"+((R34*T34)/D34)/1000000","v":4.8323642E-2}]
[null,null,null,null,"N° usuarios ",2,8,null,null,null,null,null,null,null,null,null,null,10,2]
[null,null,null,null,"Huella (g Co2 eq)",{"$f":"+((F34*$T$34)/$D$34)","v":14796.163999999999},{"$f":"+((G34*$T$34)/$D$34)","v":33527.477999999996},0,0,0,0,0,0,0,0,0,0,{"$f":"SUM(F36:Q36)","v":48323.641999999993},12]
[null,"TOTAL EMISIONES ",null,null,null,null,null,null,null,null,null,null,null,null,null,null,null,null,null,null,null,{"$f":"+SUM(V25:V35)","v":0.83166767399999997}]
[]
["TRANSPORTE URBANO "]
[2019,"MODO DE TRANSPORTE",null,"CAPACIDAD DE CARGA ","UNIDAD","Km recorridos , número de usuarios y huella de carbono por  mes ",null,null,null,null,null,null,null,null,null,null,null,null,"No. DE DATOS","FACTOR DE EMISIÓN ","UNIDADES DEL FACTOR","HUELLA DE CARBONO (TON CO2 eq)"]
[null,null,null,null,null,"ENE","FEB","MAR","ABR","MAY","JUN","JUL","AGO","SEP","OCT","NOV","DIC","TOTAL"]
[null,"Escoja la opción que corresponda",null,null,null,"Digite la cantidad de Km recorridos por mes y el número de usuarios por cada tipo de transporte "]
[null,"SITP <6000 c.c.",null,{"$f":"+VLOOKUP(B43,'[1]FACTORES DE EMISIÓN'!$BV$5:$BY$8,4,FALSE)","v":40},"km recorridos ",1128,1960,null,null,null,null,null,null,null,null,null,null,{"$f":"SUM(F43:Q43)","v":3088},{"$f":"COUNT(F43:Q43)","v":2},{"$f":"IFERROR(VLOOKUP(B43,'[1]FACTORES DE EMISIÓN'!$BV$5:$BX$8,3,0),0)","v":787.03},"g/km",{"$f":"+((R43*T43)/D43)/1000000","v":6.0758715999999997E-2}]
[null,null,null,null,"N° usuarios ",3,3,null,null,null,null,null,null,null,null,null,null,{"$f":"SUM(F44:Q44)","v":6},{"$f":"COUNT(F44:Q44)","v":2}]
[null,null,null,null,"Huella (g Co2 eq)",{"$f":"+((F43*$T$43)/$D$43)","v":22194.245999999999},{"$f":"+((G43*$T$43)/$D$43)","v":38564.47},0,0,0,0,0,0,0,0,0,0,{"$f":"SUM(F45:Q45)","v":60758.716},12]
[null,"Motocicleta 4 tiempos ",null,{"$f":"+VLOOKUP(B46,'[1]FACTORES DE EMISIÓN'!$BV$5:$BY$8,4,FALSE)","v":1},"km recorridos ",2552,424,null,null,null,null,null,null,null,null,null,null,{"$f":"SUM(F46:Q46)","v":2976},2,{"$f":"IFERROR(VLOOKUP(B46,'[1]FACTORES DE EMISIÓN'!$BV$5:$BX$8,3,0),0)","v":33.11},"g/km",{"$f":"+((R46*T46)/D46)/1000000","v":9.8535360000000002E-2}]
[null,null,null,null,"N° usuarios ",5,1,null,null,null,null,null,null,null,null,null,null,6,2]
[null,null,null,null,"Huella (g Co2 eq)",{"$f":"+((F46*$T$46)/$D$46)","v":84496.72},{"$f":"+((G46*$T$46)/$D$46)","v":14038.64},0,0,0,0,0,0,0,0,0,0,98535.360000000001,12]
[null,"Vehículo propio TWC;>1400c.c ",null,{"$f":"+VLOOKUP(B49,'[1]FACTORES DE EMISIÓN'!$BV$5:$BY$8,4,FALSE)","v":1},"km recorridos ",2304,768,null,null,null,null,null,null,null,null,null,null,3072,2,{"$f":"IFERROR(VLOOKUP(B49,'[1]FACTORES DE EMISIÓN'!$BV$5:$BX$8,3,0),0)","v":218},"g/km",{"$f":"+((R49*T49)/D49)/1000000","v":0.66969599999999996}]
[null,null,null,null,"N° usuarios ",3,1,null,null,null,null,null,null,null,null,null,null,4,2]
[null,null,null,null,"Huella (g Co2 eq)",{"$f":"+((F49*$T$49)/$D$49)","v":502272},{"$f":"+((G49*$T$49)/$D$49)","v":167424},0,0,0,0,0,0,0,0,0,0,{"$f":"SUM(F51:Q51)","v":669696},12]
[null,"SITP <6000 c.c.",null,{"$f":"+VLOOKUP(B52,'[1]FACTORES DE EMISIÓN'!$BV$5:$BY$8,4,FALSE)","v":40},"km recorridos ",752,1704,null,null,null,null,null,null,null,null,null,null,{"$f":"SUM(F52:Q52)","v":2456},2,{"$f":"IFERROR(VLOOKUP(B52,'[1]FACTORES DE EMISIÓN'!$BV$5:$BX$8,3,0),0)","v":787.03},"g/km",{"$f":"+((R52*T52)/D52)/1000000","v":4.8323642E-2}]
[null,null,null,null,"N° usuarios ",2,8,null,null,null,null,null,null,null,null,null,null,10,2]
[null,null,null,null,"Huella (g Co2 eq)",{"$f":"+((F52*$T$52)/$D$52)","v":14796.163999999999},{"$f":"+((G52*$T$52)/$D$52)","v":33527.477999999996},0,0,0,0,0,0,0,0,0,0,{"$f":"SUM(F54:Q54)","v":48323.641999999993},12]
[null,"TOTAL EMISIONES ",null,null,null,null,null,null,null,null,null,null,null,null,null,null,null,null,null,null,null,{"$f":"+SUM(V43:V53)","v":0.87731371799999991}]
[]
["TRANSPORTE URBANO "]
[2020,"MODO DE TRANSPORTE",null,"CAPACIDAD DE CARGA ","UNIDAD","Km recorridos , número de usuarios y huella de carbono por  mes ",null,null,null,null,null,null,null,null,null,null,null,null,"No. DE DATOS","FACTOR DE EMISIÓN ","UNIDADES DEL FACTOR","HUELLA DE CARBONO (TON CO2 eq)"]
[null,null,null,null,null,"ENE","FEB","MAR","ABR","MAY","JUN","JUL","AGO","SEP","OCT","NOV","DIC","TOTAL"]
[null,"Escoja la opción que corresponda",null,null,null,"Digite la cantidad de Km recorridos por mes y el número de usuarios por cada tipo de transporte "]
[null,"Motocicleta 4 tiempos ",null,{"$f":"+VLOOKUP(B61,'[1]FACTORES DE EMISIÓN'!$BV$5:$BY$8,4,FALSE)","v":1},"km recorridos ",600,0,null,null,null,null,null,null,null,null,null,null,{"$f":"SUM(F61:Q61)","v":600},{"$f":"COUNT(F61:Q61)","v":2},{"$f":"IFERROR(VLOOKUP(B61,'[1]FACTORES DE EMISIÓN'!$BV$5:$BX$8,3,0),0)","v":33.11},"g/km",{"$f":"+((R61*T61)/D61)/1000000","v":1.9866000000000002E-2}]
[null,null,null,null,"N° usuarios ",3,0,null,null,null,null,null,null,null,null,null,null,{"$f":"SUM(F62:Q62)","v":3},{"$f":"COUNT(F62:Q62)","v":2}]
[null,null,null,null,"Huella (g Co2 eq)",{"$f":"+((F61*$T$61)/$D$61)","v":19866},{"$f":"+((G61*$T$61)/$D$61)","v":0},0,0,0,0,0,0,0,0,0,0,{"$f":"SUM(F63:Q63)","v":19866},12]
[null,"Transmilenio",null,{"$f":"+VLOOKUP(B64,'[1]FACTORES DE EMISIÓN'!$BV$5:$BY$8,4,FALSE)","v":140},"km recorridos ",2000,2000,null,null,null,null,null,null,null,null,null,null,{"$f":"SUM(F64:Q64)","v":4000},2,{"$f":"IFERROR(VLOOKUP(B64,'[1]FACTORES DE EMISIÓN'!$BV$5:$BX$8,3,0),0)","v":685.16},"g/km",{"$f":"+((R64*T64)/D64)/1000000","v":1.9576E-2}]
[null,null,null,null,"N° usuarios ",5,1,null,null,null,null,null,null,null,null,null,null,6,2]
[null,null,null,null,"Huella (g Co2 eq)",{"$f":"+((F64*$T$64)/$D$64)","v":9788},{"$f":"+((G64*$T$64)/$D$64)","v":9788},0,0,0,0,0,0,0,0,0,0,19576,12]
[null,"SITP <6000 c.c.",null,{"$f":"+VLOOKUP(B67,'[1]FACTORES DE EMISIÓN'!$BV$5:$BY$8,4,FALSE)","v":40},"km recorridos ",2000,2000,null,null,null,null,null,null,null,null,null,null,4000,2,{"$f":"IFERROR(VLOOKUP(B67,'[1]FACTORES DE EMISIÓN'!$BV$5:$BX$8,3,0),0)","v":787.03},"g/km",{"$f":"+((R67*T67)/D67)/1000000","v":7.8702999999999995E-2}]
[null,null,null,null,"N° usuarios ",3,1,null,null,null,null,null,null,null,null,null,null,4,2]
[null,null,null,null,"Huella (g Co2 eq)",{"$f":"+((F67*$T$67)/$D$67)","v":39351.5},{"$f":"+((G67*$T$67)/$D$67)","v":39351.5},0,0,0,0,0,0,0,0,0,0,{"$f":"SUM(F69:Q69)","v":78703},12]
[null,"Vehículo propio TWC;>1400c.c ",null,{"$f":"+VLOOKUP(B70,'[1]FACTORES DE EMISIÓN'!$BV$5:$BY$8,4,FALSE)","v":1},"km recorridos ",2000,2000,null,null,null,null,null,null,null,null,null,null,{"$f":"SUM(F70:Q70)","v":4000},2,{"$f":"IFERROR(VLOOKUP(B70,'[1]FACTORES DE EMISIÓN'!$BV$5:$BX$8,3,0),0)","v":218},"g/km",{"$f":"+((R70*T70)/D70)/1000000","v":0.872}]
[null,null,null,null,"N° usuarios ",2,8,null,null,null,null,null,null,null,null,null,null,10,2]
[null,null,null,null,"Huella (g Co2 eq)",{"$f":"+((F70*$T$70)/$D$70)","v":436000},{"$f":"+((G70*$T$70)/$D$70)","v":436000},0,0,0,0,0,0,0,0,0,0,{"$f":"SUM(F72:Q72)","v":872000},12]
[null,"TOTAL EMISIONES ",null,null,null,null,null,null,null,null,null,null,null,null,null,null,null,null,null,null,null,{"$f":"+SUM(V61:V71)","v":0.99014500000000005}]
[]
["TRANSPORTE URBANO "]
[2021,"MODO DE TRANSPORTE",null,"CAPACIDAD DE CARGA ","UNIDAD","Km recorridos , número de usuarios y huella de carbono por  mes ",null,null,null,null,null,null,null,null,null,null,null,null,"No. DE DATOS","FACTOR DE EMISIÓN ","UNIDADES DEL FACTOR","HUELLA DE CARBONO (TON CO2 eq)"]
[null,null,null,null,null,"ENE","FEB","MAR","ABR","MAY","JUN","JUL","AGO","SEP","OCT","NOV","DIC","TOTAL"]
[null,"Escoja la opción que corresponda",null,null,null,"Digite la cantidad de Km recorridos por mes y el número de usuarios por cada tipo de transporte "]
[null,"Transmilenio",null,{"$f":"+VLOOKUP(B79,'[1]FACTORES DE EMISIÓN'!$BV$5:$BY$8,4,FALSE)","v":140},"km recorridos ",1128,1960,null,null,null,null,null,null,null,null,null,null,{"$f":"SUM(F79:Q79)","v":3088},{"$f":"COUNT(F79:Q79)","v":2},{"$f":"IFERROR(VLOOKUP(B79,'[1]FACTORES DE EMISIÓN'!$BV$5:$BX$8,3,0),0)","v":685.16},"g/km",{"$f":"+((R79*T79)/D79)/1000000","v":1.5112672000000001E-2}]
[null,null,null,null,"N° usuarios ",3,3,null,null,null,null,null,null,null,null,null,null,{"$f":"SUM(F80:Q80)","v":6},{"$f":"COUNT(F80:Q80)","v":2}]
[null,null,null,null,"Huella (g Co2 eq)",{"$f":"+((F79*$T$79)/$D$79)","v":5520.4319999999998},{"$f":"+((G79*$T$79)/$D$79)","v":9592.24},0,0,0,0,0,0,0,0,0,0,{"$f":"SUM(F81:Q81)","v":15112.671999999999},12]
[null,"Motocicleta 4 tiempos ",null,{"$f":"+VLOOKUP(B82,'[1]FACTORES DE EMISIÓN'!$BV$5:$BY$8,4,FALSE)","v":1},"km recorridos ",2552,424,null,null,null,null,null,null,null,null,null,null,{"$f":"SUM(F82:Q82)","v":2976},2,{"$f":"IFERROR(VLOOKUP(B82,'[1]FACTORES DE EMISIÓN'!$BV$5:$BX$8,3,0),0)","v":33.11},"g/km",{"$f":"+((R82*T82)/D82)/1000000","v":9.8535360000000002E-2}]
[null,null,null,null,"N° usuarios ",5,1,null,null,null,null,null,null,null,null,null,null,6,2]
[null,null,null,null,"Huella (g Co2 eq)",{"$f":"+((F82*$T$82)/$D$82)","v":84496.72},{"$f":"+((G82*$T$82)/$D$82)","v":14038.64},0,0,0,0,0,0,0,0,0,0,98535.360000000001,12]
[null,"SITP <6000 c.c.",null,{"$f":"+VLOOKUP(B85,'[1]FACTORES DE EMISIÓN'!$BV$5:$BY$8,4,FALSE)","v":40},"km recorridos ",2304,768,null,null,null,null,null,null,null,null,null,null,3072,2,{"$f":"IFERROR(VLOOKUP(B85,'[1]FACTORES DE EMISIÓN'!$BV$5:$BX$8,3,0),0)","v":787.03},"g/km",{"$f":"+((R85*T85)/D85)/1000000","v":6.0443904E-2}]
[null,null,null,null,"N° usuarios ",3,1,null,null,null,null,null,null,null,null,null,null,4,2]
[null,null,null,null,"Huella (g Co2 eq)",{"$f":"+((F85*$T$85)/$D$85)","v":45332.928},{"$f":"+((G85*$T$85)/$D$85)","v":15110.976000000001},0,0,0,0,0,0,0,0,0,0,{"$f":"SUM(F87:Q87)","v":60443.904000000002},12]
[null,"Vehículo propio TWC;>1400c.c ",null,{"$f":"+VLOOKUP(B88,'[1]FACTORES DE EMISIÓN'!$BV$5:$BY$8,4,FALSE)","v":1},"km recorridos ",752,1704,null,null,null,null,null,null,null,null,null,null,{"$f":"SUM(F88:Q88)","v":2456},2,{"$f":"IFERROR(VLOOKUP(B88,'[1]FACTORES DE EMISIÓN'!$BV$5:$BX$8,3,0),0)","v":218},"g/km",{"$f":"+((R88*T88)/D88)/1000000","v":0.535408}]
[null,null,null,null,"N° usuarios ",2,8,null,null,null,null,null,null,null,null,null,null,10,2]
[null,null,null,null,"Huella (g Co2 eq)",{"$f":"+((F88*$T$88)/$D$88)","v":163936},{"$f":"+((G88*$T$88)/$D$88)","v":371472},0,0,0,0,0,0,0,0,0,0,{"$f":"SUM(F90:Q90)","v":535408},12]
[null,"TOTAL EMISIONES ",null,null,null,null,null,null,null,null,null,null,null,null,null,null,null,null,null,null,null,{"$f":"+SUM(V79:V89)","v":0.70949993600000005}]
[]
["VIAJES AEREOS  NACIONALES "]
[2017,"ORIGEN","DESTINO","DISTANCIA (km)","UNIDAD","NÚMERO DE VIAJES",null,null,null,null,null,null,null,null,null,null,null,null,"No. DE DATOS","FACTOR DE EMISIÓN ","UNIDADES DEL FACTOR","HUELLA DE CARBONO \n(TON CO2)"]
[null,null,null,null,null,"ENE","FEB","MAR","ABR","MAY","JUN","JUL","AGO","SEP","OCT","NOV","DIC","TOTAL"]
[null,"Escoja la opción que corresponda",null,null,null,"Digite la cantidad de viajes por cada trayecto"]
[null,"BOGOTA,COLOMBIA ","SAN ANDRÉS ISLAS, COLOMBIA (ADZ)",{"$f":"IFERROR(VLOOKUP(C97,'[1]FACTORES DE EMISIÓN'!$CI$4:$CJ$42,2,0),0)","v":1207},"N° viajes",2,4,10,25,30,48,48,48,48,48,48,48,{"$f":"SUM(F97:Q97)","v":407},{"$f":"COUNT(F97:Q97)","v":12},{"$f":"IFERROR(VLOOKUP(C97,'[1]FACTORES DE EMISIÓN'!$CI$4:$CK$42,3,0),0)","v":114.9},"kg CO2/trayecto",{"$f":"IFERROR((R97*T97)/1000,0)","v":46.764300000000006}]
[null,"BOGOTA,COLOMBIA ","APARTADO,COLOMBIA (APO)",{"$f":"IFERROR(VLOOKUP(C98,'[1]FACTORES DE EMISIÓN'!$CI$4:$CJ$42,2,0),0)","v":446},"N° viajes",null,null,null,null,null,null,null,null,null,null,null,null,{"$f":"SUM(F98:Q98)","v":0},{"$f":"COUNT(F98:Q98)","v":0},{"$f":"IFERROR(VLOOKUP(C98,'[1]FACTORES DE EMISIÓN'!$CI$4:$CK$42,3,0),0)","v":82.1},"kg CO2/trayecto",{"$f":"IFERROR((R98*T98)/1000,0)","v":0}]
[null,"BOGOTA,COLOMBIA ","ARMENIA,COLOMBIA (AXM)",{"$f":"IFERROR(VLOOKUP(C99,'[1]FACTORES DE EMISIÓN'!$CI$4:$CJ$42,2,0),0)","v":180},"N° viajes",null,null,null,null,null,null,null,null,null,null,null,null,{"$f":"SUM(F99:Q99)","v":0},{"$f":"COUNT(F99:Q99)","v":0},{"$f":"IFERROR(VLOOKUP(C99,'[1]FACTORES DE EMISIÓN'!$CI$4:$CK$42,3,0),0)","v":28.7},"kg CO2/trayecto",{"$f":"IFERROR((R99*T99)/1000,0)","v":0}]
[null,"BOGOTA,COLOMBIA ","BARRANQUILLA.COLOMBIA (BAQ)",{"$f":"IFERROR(VLOOKUP(C100,'[1]FACTORES DE EMISIÓN'!$CI$4:$CJ$42,2,0),0)","v":690},"N° viajes",null,null,null,null,null,null,null,",",null,null,null,null,{"$f":"SUM(F100:Q100)","v":0},{"$f":"COUNT(F100:Q100)","v":0},{"$f":"IFERROR(VLOOKUP(C100,'[1]FACTORES DE EMISIÓN'!$CI$4:$CK$42,3,0),0)","v":82.1},"kg CO2/trayecto",{"$f":"IFERROR((R100*T100)/1000,0)","v":0}]
[null,"BOGOTA,COLOMBIA ","CALI,COLOMBIA (CLO)",{"$f":"IFERROR(VLOOKUP(C101,'[1]FACTORES DE EMISIÓN'!$CI$4:$CJ$42,2,0),0)","v":278},"N° viajes",null,null,null,null,null,null,null,null,null,null,null,null,{"$f":"SUM(F101:Q101)","v":0},{"$f":"COUNT(F101:Q101)","v":0},{"$f":"IFERROR(VLOOKUP(C101,'[1]FACTORES DE EMISIÓN'!$CI$4:$CK$42,3,0),0)","v":46.1},"kg CO2/trayecto",{"$f":"IFERROR((R101*T101)/1000,0)","v":0}]
[null,"TOTAL EMISIONES",null,null,null,null,null,null,null,null,null,null,null,null,null,null,null,null,null,null,null,{"$f":"SUM(V97:V101)","v":46.764300000000006}]
[]
["VIAJES AEREOS  NACIONALES "]
[2018,"ORIGEN","DESTINO","DISTANCIA (km)","UNIDAD","NÚMERO DE VIAJES",null,null,null,null,null,null,null,null,null,null,null,null,"No. DE DATOS","FACTOR DE EMISIÓN ","UNIDADES DEL FACTOR","HUELLA DE CARBONO \n(TON CO2)"]
[null,null,null,null,null,"ENE","FEB","MAR","ABR","MAY","JUN","JUL","AGO","SEP","OCT","NOV","DIC","TOTAL"]
[null,"Escoja la opción que corresponda",null,null,null,"Digite la cantidad de viajes por cada trayecto"]
[null,"BOGOTÁ, COLOMBIA (BOG)","CALI,COLOMBIA (CLO)",{"$f":"IFERROR(VLOOKUP(C108,'[1]FACTORES DE EMISIÓN'!$CI$4:$CJ$42,2,0),0)","v":278},"N° viajes",2,4,null,null,null,null,null,null,null,null,null,null,{"$f":"SUM(F108:Q108)","v":6},{"$f":"COUNT(F108:Q108)","v":2},{"$f":"IFERROR(VLOOKUP(C108,'[1]FACTORES DE EMISIÓN'!$CI$4:$CK$42,3,0),0)","v":46.1},"kg CO2/trayecto",{"$f":"IFERROR((R108*T108)/1000,0)","v":0.27660000000000001}]
[null,"BOGOTÁ, COLOMBIA (BOG)","CALI,COLOMBIA (CLO)",{"$f":"IFERROR(VLOOKUP(C109,'[1]FACTORES DE EMISIÓN'!$CI$4:$CJ$42,2,0),0)","v":278},"N° viajes",null,null,null,null,null,null,null,null,null,null,null,null,{"$f":"SUM(F109:Q109)","v":0},{"$f":"COUNT(F109:Q109)","v":0},{"$f":"IFERROR(VLOOKUP(C109,'[1]FACTORES DE EMISIÓN'!$CI$4:$CK$42,3,0),0)","v":46.1},"kg CO2/trayecto",{"$f":"IFERROR((R109*T109)/1000,0)","v":0}]
[null,"BOGOTÁ, COLOMBIA (BOG)","CALI,COLOMBIA (CLO)",{"$f":"IFERROR(VLOOKUP(C110,'[1]FACTORES DE EMISIÓN'!$CI$4:$CJ$42,2,0),0)","v":278},"N° viajes",null,null,null,null,null,null,null,null,null,null,null,null,{"$f":"SUM(F110:Q110)","v":0},{"$f":"COUNT(F110:Q110)","v":0},{"$f":"IFERROR(VLOOKUP(C110,'[1]FACTORES DE EMISIÓN'!$CI$4:$CK$42,3,0),0)","v":46.1},"kg CO2/trayecto",{"$f":"IFERROR((R110*T110)/1000,0)","v":0}]
[null,"BOGOTÁ, COLOMBIA (BOG)","CALI,COLOMBIA (CLO)",{"$f":"IFERROR(VLOOKUP(C111,'[1]FACTORES DE EMISIÓN'!$CI$4:$CJ$42,2,0),0)","v":278},"N° viajes",null,null,null,null,null,null,null,",",null,null,null,null,{"$f":"SUM(F111:Q111)","v":0},{"$f":"COUNT(F111:Q111)","v":0},{"$f":"IFERROR(VLOOKUP(C111,'[1]FACTORES DE EMISIÓN'!$CI$4:$CK$42,3,0),0)","v":46.1},"kg CO2/trayecto",{"$f":"IFERROR((R111*T111)/1000,0)","v":0}]
[null,"BOGOTÁ, COLOMBIA (BOG)","CALI,COLOMBIA (CLO)",{"$f":"IFERROR(VLOOKUP(C112,'[1]FACTORES DE EMISIÓN'!$CI$4:$CJ$42,2,0),0)","v":278},"N° viajes",null,null,null,null,null,null,null,null,null,null,null,null,{"$f":"SUM(F112:Q112)","v":0},{"$f":"COUNT(F112:Q112)","v":0},{"$f":"IFERROR(VLOOKUP(C112,'[1]FACTORES DE EMISIÓN'!$CI$4:$CK$42,3,0),0)","v":46.1},"kg CO2/trayecto",{"$f":"IFERROR((R112*T112)/1000,0)","v":0}]
[null,"TOTAL EMISIONES",null,null,null,null,null,null,null,null,null,null,null,null,null,null,null,null,null,null,null,{"$f":"SUM(V108:V112)","v":0.27660000000000001}]
[]
["VIAJES AEREOS  NACIONALES "]
[2019,"ORIGEN","DESTINO","DISTANCIA (km)","UNIDAD","NÚMERO DE VIAJES",null,null,null,null,null,null,null,null,null,null,null,null,"No. DE DATOS","FACTOR DE EMISIÓN ","UNIDADES DEL FACTOR","HUELLA DE CARBONO \n(TON CO2)"]
[null,null,null,null,null,"ENE","FEB","MAR","ABR","MAY","JUN","JUL","AGO","SEP","OCT","NOV","DIC","TOTAL"]
[null,"Escoja la opción que corresponda",null,null,null,"Digite la cantidad de viajes por cada trayecto"]
[null,"BOGOTÁ, COLOMBIA (BOG)","CALI,COLOMBIA (CLO)",{"$f":"IFERROR(VLOOKUP(C119,'[1]FACTORES DE EMISIÓN'!$CI$4:$CJ$42,2,0),0)","v":278},"N° viajes",2,4,null,null,null,null,null,null,null,null,null,null,{"$f":"SUM(F119:Q119)","v":6},{"$f":"COUNT(F119:Q119)","v":2},{"$f":"IFERROR(VLOOKUP(C119,'[1]FACTORES DE EMISIÓN'!$CI$4:$CK$42,3,0),0)","v":46.1},"kg CO2/trayecto",{"$f":"IFERROR((R119*T119)/1000,0)","v":0.27660000000000001}]
[null,"BOGOTÁ, COLOMBIA (BOG)","CALI,COLOMBIA (CLO)",{"$f":"IFERROR(VLOOKUP(C120,'[1]FACTORES DE EMISIÓN'!$CI$4:$CJ$42,2,0),0)","v":278},"N° viajes",null,null,null,null,null,null,null,null,null,null,null,null,{"$f":"SUM(F120:Q120)","v":0},{"$f":"COUNT(F120:Q120)","v":0},{"$f":"IFERROR(VLOOKUP(C120,'[1]FACTORES DE EMISIÓN'!$CI$4:$CK$42,3,0),0)","v":46.1},"kg CO2/trayecto",{"$f":"IFERROR((R120*T120)/1000,0)","v":0}]
[null,"BOGOTÁ, COLOMBIA (BOG)","CALI,COLOMBIA (CLO)",{"$f":"IFERROR(VLOOKUP(C121,'[1]FACTORES DE EMISIÓN'!$CI$4:$CJ$42,2,0),0)","v":278},"N° viajes",null,null,null,null,null,null,null,null,null,null,null,null,{"$f":"SUM(F121:Q121)","v":0},{"$f":"COUNT(F121:Q121)","v":0},{"$f":"IFERROR(VLOOKUP(C121,'[1]FACTORES DE EMISIÓN'!$CI$4:$CK$42,3,0),0)","v":46.1},"kg CO2/trayecto",{"$f":"IFERROR((R121*T121)/1000,0)","v":0}]
[null,"BOGOTÁ, COLOMBIA (BOG)","CALI,COLOMBIA (CLO)",{"$f":"IFERROR(VLOOKUP(C122,'[1]FACTORES DE EMISIÓN'!$CI$4:$CJ$42,2,0),0)","v":278},"N° viajes",null,null,null,null,null,null,null,",",null,null,null,null,{"$f":"SUM(F122:Q122)","v":0},{"$f":"COUNT(F122:Q122)","v":0},{"$f":"IFERROR(VLOOKUP(C122,'[1]FACTORES DE EMISIÓN'!$CI$4:$CK$42,3,0),0)","v":46.1},"kg CO2/trayecto",{"$f":"IFERROR((R122*T122)/1000,0)","v":0}]
[null,"BOGOTÁ, COLOMBIA (BOG)","CALI,COLOMBIA (CLO)",{"$f":"IFERROR(VLOOKUP(C123,'[1]FACTORES DE EMISIÓN'!$CI$4:$CJ$42,2,0),0)","v":278},"N° viajes",null,null,null,null,null,null,null,null,null,null,null,null,{"$f":"SUM(F123:Q123)","v":0},{"$f":"COUNT(F123:Q123)","v":0},{"$f":"IFERROR(VLOOKUP(C123,'[1]FACTORES DE EMISIÓN'!$CI$4:$CK$42,3,0),0)","v":46.1},"kg CO2/trayecto",{"$f":"IFERROR((R123*T123)/1000,0)","v":0}]
[null,"TOTAL EMISIONES",null,null,null,null,null,null,null,null,null,null,null,null,null,null,null,null,null,null,null,{"$f":"SUM(V119:V123)","v":0.27660000000000001}]
[]
["VIAJES AEREOS  NACIONALES "]
[2020,"ORIGEN","DESTINO","DISTANCIA (km)","UNIDAD","NÚMERO DE VIAJES",null,null,null,null,null,null,null,null,null,null,null,null,"No. DE DATOS","FACTOR DE EMISIÓN ","UNIDADES DEL FACTOR","HUELLA DE CARBONO \n(TON CO2)"]
[null,null,null,null,null,"ENE","FEB","MAR","ABR","MAY","JUN","JUL","AGO","SEP","OCT","NOV","DIC","TOTAL"]
[null,"Escoja la opción que corresponda",null,null,null,"Digite la cantidad de viajes por cada trayecto"]
[null,"BOGOTÁ, COLOMBIA (BOG)","CALI,COLOMBIA (CLO)",{"$f":"IFERROR(VLOOKUP(C130,'[1]FACTORES DE EMISIÓN'!$CI$4:$CJ$42,2,0),0)","v":278},"N° viajes",2,4,null,null,null,null,null,null,null,null,null,null,{"$f":"SUM(F130:Q130)","v":6},{"$f":"COUNT(F130:Q130)","v":2},{"$f":"IFERROR(VLOOKUP(C130,'[1]FACTORES DE EMISIÓN'!$CI$4:$CK$42,3,0),0)","v":46.1},"kg CO2/trayecto",{"$f":"IFERROR((R130*T130)/1000,0)","v":0.27660000000000001}]
[null,"BOGOTÁ, COLOMBIA (BOG)","CALI,COLOMBIA (CLO)",{"$f":"IFERROR(VLOOKUP(C131,'[1]FACTORES DE EMISIÓN'!$CI$4:$CJ$42,2,0),0)","v":278},"N° viajes",null,null,null,null,null,null,null,null,null,null,null,null,{"$f":"SUM(F131:Q131)","v":0},{"$f":"COUNT(F131:Q131)","v":0},{"$f":"IFERROR(VLOOKUP(C131,'[1]FACTORES DE EMISIÓN'!$CI$4:$CK$42,3,0),0)","v":46.1},"kg CO2/trayecto",{"$f":"IFERROR((R131*T131)/1000,0)","v":0}]
[null,"BOGOTÁ, COLOMBIA (BOG)","CALI,COLOMBIA (CLO)",{"$f":"IFERROR(VLOOKUP(C132,'[1]FACTORES DE EMISIÓN'!$CI$4:$CJ$42,2,0),0)","v":278},"N° viajes",null,null,null,null,null,null,null,null,null,null,null,null,{"$f":"SUM(F132:Q132)","v":0},{"$f":"COUNT(F132:Q132)","v":0},{"$f":"IFERROR(VLOOKUP(C132,'[1]FACTORES DE EMISIÓN'!$CI$4:$CK$42,3,0),0)","v":46.1},"kg CO2/trayecto",{"$f":"IFERROR((R132*T132)/1000,0)","v":0}]
[null,"BOGOTÁ, COLOMBIA (BOG)","CALI,COLOMBIA (CLO)",{"$f":"IFERROR(VLOOKUP(C133,'[1]FACTORES DE EMISIÓN'!$CI$4:$CJ$42,2,0),0)","v":278},"N° viajes",null,null,null,null,null,null,null,",",null,null,null,null,{"$f":"SUM(F133:Q133)","v":0},{"$f":"COUNT(F133:Q133)","v":0},{"$f":"IFERROR(VLOOKUP(C133,'[1]FACTORES DE EMISIÓN'!$CI$4:$CK$42,3,0),0)","v":46.1},"kg CO2/trayecto",{"$f":"IFERROR((R133*T133)/1000,0)","v":0}]
[null,"BOGOTÁ, COLOMBIA (BOG)","CALI,COLOMBIA (CLO)",{"$f":"IFERROR(VLOOKUP(C134,'[1]FACTORES DE EMISIÓN'!$CI$4:$CJ$42,2,0),0)","v":278},"N° viajes",null,null,null,null,null,null,null,null,null,null,null,null,{"$f":"SUM(F134:Q134)","v":0},{"$f":"COUNT(F134:Q134)","v":0},{"$f":"IFERROR(VLOOKUP(C134,'[1]FACTORES DE EMISIÓN'!$CI$4:$CK$42,3,0),0)","v":46.1},"kg CO2/trayecto",{"$f":"IFERROR((R134*T134)/1000,0)","v":0}]
[null,"TOTAL EMISIONES",null,null,null,null,null,null,null,null,null,null,null,null,null,null,null,null,null,null,null,{"$f":"SUM(V130:V134)","v":0.27660000000000001}]
[]
["VIAJES AEREOS  NACIONALES "]
[2021,"ORIGEN","DESTINO","DISTANCIA (km)","UNIDAD","NÚMERO DE VIAJES",null,null,null,null,null,null,null,null,null,null,null,null,"No. DE DATOS","FACTOR DE EMISIÓN ","UNIDADES DEL FACTOR","HUELLA DE CARBONO \n(TON CO2)"]
[null,null,null,null,null,"ENE","FEB","MAR","ABR","MAY","JUN","JUL","AGO","SEP","OCT","NOV","DIC","TOTAL"]
[null,"Escoja la opción que corresponda",null,null,null,"Digite la cantidad de viajes por cada trayecto"]
[null,"BOGOTÁ, COLOMBIA (BOG)","CALI,COLOMBIA (CLO)",{"$f":"IFERROR(VLOOKUP(C141,'[1]FACTORES DE EMISIÓN'!$CI$4:$CJ$42,2,0),0)","v":278},"N° viajes",2,4,null,null,null,null,null,null,null,null,null,null,{"$f":"SUM(F141:Q141)","v":6},{"$f":"COUNT(F141:Q141)","v":2},{"$f":"IFERROR(VLOOKUP(C141,'[1]FACTORES DE EMISIÓN'!$CI$4:$CK$42,3,0),0)","v":46.1},"kg CO2/trayecto",{"$f":"IFERROR((R141*T141)/1000,0)","v":0.27660000000000001}]
[null,"BOGOTÁ, COLOMBIA (BOG)","CALI,COLOMBIA (CLO)",{"$f":"IFERROR(VLOOKUP(C142,'[1]FACTORES DE EMISIÓN'!$CI$4:$CJ$42,2,0),0)","v":278},"N° viajes",null,null,null,null,null,null,null,null,null,null,null,null,{"$f":"SUM(F142:Q142)","v":0},{"$f":"COUNT(F142:Q142)","v":0},{"$f":"IFERROR(VLOOKUP(C142,'[1]FACTORES DE EMISIÓN'!$CI$4:$CK$42,3,0),0)","v":46.1},"kg CO2/trayecto",{"$f":"IFERROR((R142*T142)/1000,0)","v":0}]
[null,"BOGOTÁ, COLOMBIA (BOG)","CALI,COLOMBIA (CLO)",{"$f":"IFERROR(VLOOKUP(C143,'[1]FACTORES DE EMISIÓN'!$CI$4:$CJ$42,2,0),0)","v":278},"N° viajes",null,null,null,null,null,null,null,null,null,null,null,null,{"$f":"SUM(F143:Q143)","v":0},{"$f":"COUNT(F143:Q143)","v":0},{"$f":"IFERROR(VLOOKUP(C143,'[1]FACTORES DE EMISIÓN'!$CI$4:$CK$42,3,0),0)","v":46.1},"kg CO2/trayecto",{"$f":"IFERROR((R143*T143)/1000,0)","v":0}]
[null,"BOGOTÁ, COLOMBIA (BOG)","CALI,COLOMBIA (CLO)",{"$f":"IFERROR(VLOOKUP(C144,'[1]FACTORES DE EMISIÓN'!$CI$4:$CJ$42,2,0),0)","v":278},"N° viajes",null,null,null,null,null,null,null,",",null,null,null,null,{"$f":"SUM(F144:Q144)","v":0},{"$f":"COUNT(F144:Q144)","v":0},{"$f":"IFERROR(VLOOKUP(C144,'[1]FACTORES DE EMISIÓN'!$CI$4:$CK$42,3,0),0)","v":46.1},"kg CO2/trayecto",{"$f":"IFERROR((R144*T144)/1000,0)","v":0}]
[null,"BOGOTÁ, COLOMBIA (BOG)","CALI,COLOMBIA (CLO)",{"$f":"IFERROR(VLOOKUP(C145,'[1]FACTORES DE EMISIÓN'!$CI$4:$CJ$42,2,0),0)","v":278},"N° viajes",null,null,null,null,null,null,null,null,null,null,null,null,{"$f":"SUM(F145:Q145)","v":0},{"$f":"COUNT(F145:Q145)","v":0},{"$f":"IFERROR(VLOOKUP(C145,'[1]FACTORES DE EMISIÓN'!$CI$4:$CK$42,3,0),0)","v":46.1},"kg CO2/trayecto",{"$f":"IFERROR((R145*T145)/1000,0)","v":0}]
[null,"TOTAL EMISIONES",null,null,null,null,null,null,null,null,null,null,null,null,null,null,null,null,null,null,null,{"$f":"SUM(V141:V145)","v":0.27660000000000001}]
[]
[]
["VIAJES AÉREOS INTERNACIONALES"]
[2017,"ORIGEN","DESTINO","DISTANCIA (km)","UNIDAD","NÚMERO DE VIAJES",null,null,null,null,null,null,null,null,null,null,null,null,"No. DE DATOS","FACTOR DE EMISIÓN ","UNIDADES DEL FACTOR","HUELLA DE CARBONO \n(TON CO2)"]
[null,null,null,null,null,"ENE","FEB","MAR","ABR","MAY","JUN","JUL","AGO","SEP","OCT","NOV","DIC","TOTAL"]
[null,null,"Escoja la opción que corresponda",null,null,"Digite la cantidad de viajes por cada trayecto"]
[null,"BOGOTÁ, COLOMBIA (BOG)","BOSTON,MA,UNST (BOS)",{"$f":"IFERROR(VLOOKUP(C153,'[1]FACTORES DE EMISIÓN'!$CN$4:$CO$47,2,0),0)","v":4196},"N° viajes",null,null,null,null,null,null,null,null,null,null,null,null,{"$f":"SUM(F153:Q153)","v":0},{"$f":"COUNT(F153:Q153)","v":0},{"$f":"IFERROR(VLOOKUP(C153,'[1]FACTORES DE EMISIÓN'!$CN$4:$CP$47,3,0),0)","v":303.5},"kg CO2/trayecto",{"$f":"IFERROR((R153*T153)/1000,0)","v":0}]
[null,"BOGOTÁ, COLOMBIA (BOG)","BOSTON,MA,UNST (BOS)",{"$f":"IFERROR(VLOOKUP(C154,'[1]FACTORES DE EMISIÓN'!$CN$4:$CO$47,2,0),0)","v":4196},"N° viajes",null,null,null,null,null,null,null,null,null,null,null,null,{"$f":"SUM(F154:Q154)","v":0},{"$f":"COUNT(F154:Q154)","v":0},{"$f":"IFERROR(VLOOKUP(C154,'[1]FACTORES DE EMISIÓN'!$CN$4:$CP$47,3,0),0)","v":303.5},"kg CO2/trayecto",{"$f":"IFERROR((R154*T154)/1000,0)","v":0}]
[null,"BOGOTÁ, COLOMBIA (BOG)","BOSTON,MA,UNST (BOS)",{"$f":"IFERROR(VLOOKUP(C155,'[1]FACTORES DE EMISIÓN'!$CN$4:$CO$47,2,0),0)","v":4196},"N° viajes",null,null,null,null,null,null,null,null,null,null,null,null,{"$f":"SUM(F155:Q155)","v":0},{"$f":"COUNT(F155:Q155)","v":0},{"$f":"IFERROR(VLOOKUP(C155,'[1]FACTORES DE EMISIÓN'!$CN$4:$CP$47,3,0),0)","v":303.5},"kg CO2/trayecto",{"$f":"IFERROR((R155*T155)/1000,0)","v":0}]
[null,"BOGOTÁ, COLOMBIA (BOG)","BOSTON,MA,UNST (BOS)",{"$f":"IFERROR(VLOOKUP(C156,'[1]FACTORES DE EMISIÓN'!$CN$4:$CO$47,2,0),0)","v":4196},"N° viajes",null,null,null,null,null,null,null,",",null,null,null,null,{"$f":"SUM(F156:Q156)","v":0},{"$f":"COUNT(F156:Q156)","v":0},{"$f":"IFERROR(VLOOKUP(C156,'[1]FACTORES DE EMISIÓN'!$CN$4:$CP$47,3,0),0)","v":303.5},"kg CO2/trayecto",{"$f":"IFERROR((R156*T156)/1000,0)","v":0}]
[null,"BOGOTÁ, COLOMBIA (BOG)","BOSTON,MA,UNST (BOS)",{"$f":"IFERROR(VLOOKUP(C157,'[1]FACTORES DE EMISIÓN'!$CN$4:$CO$47,2,0),0)","v":4196},"N° viajes",null,null,null,null,null,null,null,null,null,null,null,null,{"$f":"SUM(F157:Q157)","v":0},{"$f":"COUNT(F157:Q157)","v":0},{"$f":"IFERROR(VLOOKUP(C157,'[1]FACTORES DE EMISIÓN'!$CN$4:$CP$47,3,0),0)","v":303.5},"kg CO2/trayecto",{"$f":"IFERROR((R157*T157)/1000,0)","v":0}]
[null,"TOTAL EMISIONES",null,null,null,null,null,null,null,null,null,null,null,null,null,null,null,null,null,null,null,{"$f":"SUM(V153:V157)","v":0}]
[]
[]
["VIAJES AÉREOS INTERNACIONALES"]
[2018,"ORIGEN","DESTINO","DISTANCIA (km)","UNIDAD","NÚMERO DE VIAJES",null,null,null,null,null,null,null,null,null,null,null,null,"No. DE DATOS","FACTOR DE EMISIÓN ","UNIDADES DEL FACTOR","HUELLA DE CARBONO \n(TON CO2)"]
[null,null,null,null,null,"ENE","FEB","MAR","ABR","MAY","JUN","JUL","AGO","SEP","OCT","NOV","DIC","TOTAL"]
[null,null,"Escoja la opción que corresponda",null,null,"Digite la cantidad de viajes por cada trayecto"]
[null,"BOGOTÁ, COLOMBIA (BOG)","BOSTON,MA,UNST (BOS)",{"$f":"IFERROR(VLOOKUP(C165,'[1]FACTORES DE EMISIÓN'!$CN$4:$CO$47,2,0),0)","v":4196},"N° viajes",50,50,50,50,50,50,50,50,50,50,50,50,{"$f":"SUM(F165:Q165)","v":600},{"$f":"COUNT(F165:Q165)","v":12},{"$f":"IFERROR(VLOOKUP(C165,'[1]FACTORES DE EMISIÓN'!$CN$4:$CP$47,3,0),0)","v":303.5},"kg CO2/trayecto",{"$f":"IFERROR((R165*T165)/1000,0)","v":182.1}]
[null,"BOGOTÁ, COLOMBIA (BOG)","BOSTON,MA,UNST (BOS)",{"$f":"IFERROR(VLOOKUP(C166,'[1]FACTORES DE EMISIÓN'!$CN$4:$CO$47,2,0),0)","v":4196},"N° viajes",null,null,null,null,null,null,null,null,null,null,null,null,{"$f":"SUM(F166:Q166)","v":0},{"$f":"COUNT(F166:Q166)","v":0},{"$f":"IFERROR(VLOOKUP(C166,'[1]FACTORES DE EMISIÓN'!$CN$4:$CP$47,3,0),0)","v":303.5},"kg CO2/trayecto",{"$f":"IFERROR((R166*T166)/1000,0)","v":0}]
[null,"BOGOTÁ, COLOMBIA (BOG)","BOSTON,MA,UNST (BOS)",{"$f":"IFERROR(VLOOKUP(C167,'[1]FACTORES DE EMISIÓN'!$CN$4:$CO$47,2,0),0)","v":4196},"N° viajes",null,null,null,null,null,null,null,null,null,null,null,null,{"$f":"SUM(F167:Q167)","v":0},{"$f":"COUNT(F167:Q167)","v":0},{"$f":"IFERROR(VLOOKUP(C167,'[1]FACTORES DE EMISIÓN'!$CN$4:$CP$47,3,0),0)","v":303.5},"kg CO2/trayecto",{"$f":"IFERROR((R167*T167)/1000,0)","v":0}]
[null,"BOGOTÁ, COLOMBIA (BOG)","BOSTON,MA,UNST (BOS)",{"$f":"IFERROR(VLOOKUP(C168,'[1]FACTORES DE EMISIÓN'!$CN$4:$CO$47,2,0),0)","v":4196},"N° viajes",null,null,null,null,null,null,null,",",null,null,null,null,{"$f":"SUM(F168:Q168)","v":0},{"$f":"COUNT(F168:Q168)","v":0},{"$f":"IFERROR(VLOOKUP(C168,'[1]FACTORES DE EMISIÓN'!$CN$4:$CP$47,3,0),0)","v":303.5},"kg CO2/trayecto",{"$f":"IFERROR((R168*T168)/1000,0)","v":0}]
[null,"BOGOTÁ, COLOMBIA (BOG)","BOSTON,MA,UNST (BOS)",{"$f":"IFERROR(VLOOKUP(C169,'[1]FACTORES DE EMISIÓN'!$CN$4:$CO$47,2,0),0)","v":4196},"N° viajes",null,null,null,null,null,null,null,null,null,null,null,null,{"$f":"SUM(F169:Q169)","v":0},{"$f":"COUNT(F169:Q169)","v":0},{"$f":"IFERROR(VLOOKUP(C169,'[1]FACTORES DE EMISIÓN'!$CN$4:$CP$47,3,0),0)","v":303.5},"kg CO2/trayecto",{"$f":"IFERROR((R169*T169)/1000,0)","v":0}]
[null,"TOTAL EMISIONES",null,null,null,null,null,null,null,null,null,null,null,null,null,null,null,null,null,null,null,{"$f":"SUM(V165:V169)","v":182.1}]
[]
[]
["VIAJES AÉREOS INTERNACIONALES"]
[2019,"ORIGEN","DESTINO","DISTANCIA (km)","UNIDAD","NÚMERO DE VIAJES",null,null,null,null,null,null,null,null,null,null,null,null,"No. DE DATOS","FACTOR DE EMISIÓN ","UNIDADES DEL FACTOR","HUELLA DE CARBONO \n(TON CO2)"]
[null,null,null,null,null,"ENE","FEB","MAR","ABR","MAY","JUN","JUL","AGO","SEP","OCT","NOV","DIC","TOTAL"]
[null,null,"Escoja la opción que corresponda",null,null,"Digite la cantidad de viajes por cada trayecto"]
[null,"BOGOTÁ, COLOMBIA (BOG)","BOSTON,MA,UNST (BOS)",{"$f":"IFERROR(VLOOKUP(C177,'[1]FACTORES DE EMISIÓN'!$CN$4:$CO$47,2,0),0)","v":4196},"N° viajes",null,null,null,null,null,null,null,null,null,null,null,null,{"$f":"SUM(F177:Q177)","v":0},{"$f":"COUNT(F177:Q177)","v":0},{"$f":"IFERROR(VLOOKUP(C177,'[1]FACTORES DE EMISIÓN'!$CN$4:$CP$47,3,0),0)","v":303.5},"kg CO2/trayecto",{"$f":"IFERROR((R177*T177)/1000,0)","v":0}]
[null,"BOGOTÁ, COLOMBIA (BOG)","BOSTON,MA,UNST (BOS)",{"$f":"IFERROR(VLOOKUP(C178,'[1]FACTORES DE EMISIÓN'!$CN$4:$CO$47,2,0),0)","v":4196},"N° viajes",null,null,null,null,null,null,null,null,null,null,null,null,{"$f":"SUM(F178:Q178)","v":0},{"$f":"COUNT(F178:Q178)","v":0},{"$f":"IFERROR(VLOOKUP(C178,'[1]FACTORES DE EMISIÓN'!$CN$4:$CP$47,3,0),0)","v":303.5},"kg CO2/trayecto",{"$f":"IFERROR((R178*T178)/1000,0)","v":0}]
[null,"BOGOTÁ, COLOMBIA (BOG)","BOSTON,MA,UNST (BOS)",{"$f":"IFERROR(VLOOKUP(C179,'[1]FACTORES DE EMISIÓN'!$CN$4:$CO$47,2,0),0)","v":4196},"N° viajes",null,null,null,null,null,null,null,null,null,null,null,null,{"$f":"SUM(F179:Q179)","v":0},{"$f":"COUNT(F179:Q179)","v":0},{"$f":"IFERROR(VLOOKUP(C179,'[1]FACTORES DE EMISIÓN'!$CN$4:$CP$47,3,0),0)","v":303.5},"kg CO2/trayecto",{"$f":"IFERROR((R179*T179)/1000,0)","v":0}]
[null,"BOGOTÁ, COLOMBIA (BOG)","BOSTON,MA,UNST (BOS)",{"$f":"IFERROR(VLOOKUP(C180,'[1]FACTORES DE EMISIÓN'!$CN$4:$CO$47,2,0),0)","v":4196},"N° viajes",null,null,null,null,null,null,null,",",null,null,null,null,{"$f":"SUM(F180:Q180)","v":0},{"$f":"COUNT(F180:Q180)","v":0},{"$f":"IFERROR(VLOOKUP(C180,'[1]FACTORES DE EMISIÓN'!$CN$4:$CP$47,3,0),0)","v":303.5},"kg CO2/trayecto",{"$f":"IFERROR((R180*T180)/1000,0)","v":0}]
[null,"BOGOTÁ, COLOMBIA (BOG)","BOSTON,MA,UNST (BOS)",{"$f":"IFERROR(VLOOKUP(C181,'[1]FACTORES DE EMISIÓN'!$CN$4:$CO$47,2,0),0)","v":4196},"N° viajes",null,null,null,null,null,null,null,null,null,null,null,null,{"$f":"SUM(F181:Q181)","v":0},{"$f":"COUNT(F181:Q181)","v":0},{"$f":"IFERROR(VLOOKUP(C181,'[1]FACTORES DE EMISIÓN'!$CN$4:$CP$47,3,0),0)","v":303.5},"kg CO2/trayecto",{"$f":"IFERROR((R181*T181)/1000,0)","v":0}]
[null,"TOTAL EMISIONES",null,null,null,null,null,null,null,null,null,null,null,null,null,null,null,null,null,null,null,{"$f":"SUM(V177:V181)","v":0}]
[]
[]
["VIAJES AÉREOS INTERNACIONALES"]
[2020,"ORIGEN","DESTINO","DISTANCIA (km)","UNIDAD","NÚMERO DE VIAJES",null,null,null,null,null,null,null,null,null,null,null,null,"No. DE DATOS","FACTOR DE EMISIÓN ","UNIDADES DEL FACTOR","HUELLA DE CARBONO \n(TON CO2)"]
[null,null,null,null,null,"ENE","FEB","MAR","ABR","MAY","JUN","JUL","AGO","SEP","OCT","NOV","DIC","TOTAL"]
[null,null,"Escoja la opción que corresponda",null,null,"Digite la cantidad de viajes por cada trayecto"]
[null,"BOGOTÁ, COLOMBIA (BOG)","BOSTON,MA,UNST (BOS)",{"$f":"IFERROR(VLOOKUP(C189,'[1]FACTORES DE EMISIÓN'!$CN$4:$CO$47,2,0),0)","v":4196},"N° viajes",null,null,null,null,null,null,null,null,null,null,null,null,{"$f":"SUM(F189:Q189)","v":0},{"$f":"COUNT(F189:Q189)","v":0},{"$f":"IFERROR(VLOOKUP(C189,'[1]FACTORES DE EMISIÓN'!$CN$4:$CP$47,3,0),0)","v":303.5},"kg CO2/trayecto",{"$f":"IFERROR((R189*T189)/1000,0)","v":0}]
[null,"BOGOTÁ, COLOMBIA (BOG)","BOSTON,MA,UNST (BOS)",{"$f":"IFERROR(VLOOKUP(C190,'[1]FACTORES DE EMISIÓN'!$CN$4:$CO$47,2,0),0)","v":4196},"N° viajes",null,null,null,null,null,null,null,null,null,null,null,null,{"$f":"SUM(F190:Q190)","v":0},{"$f":"COUNT(F190:Q190)","v":0},{"$f":"IFERROR(VLOOKUP(C190,'[1]FACTORES DE EMISIÓN'!$CN$4:$CP$47,3,0),0)","v":303.5},"kg CO2/trayecto",{"$f":"IFERROR((R190*T190)/1000,0)","v":0}]
[null,"BOGOTÁ, COLOMBIA (BOG)","BOSTON,MA,UNST (BOS)",{"$f":"IFERROR(VLOOKUP(C191,'[1]FACTORES DE EMISIÓN'!$CN$4:$CO$47,2,0),0)","v":4196},"N° viajes",null,null,null,null,null,null,null,null,null,null,null,null,{"$f":"SUM(F191:Q191)","v":0},{"$f":"COUNT(F191:Q191)","v":0},{"$f":"IFERROR(VLOOKUP(C191,'[1]FACTORES DE EMISIÓN'!$CN$4:$CP$47,3,0),0)","v":303.5},"kg CO2/trayecto",{"$f":"IFERROR((R191*T191)/1000,0)","v":0}]
[null,"BOGOTÁ, COLOMBIA (BOG)","BOSTON,MA,UNST (BOS)",{"$f":"IFERROR(VLOOKUP(C192,'[1]FACTORES DE EMISIÓN'!$CN$4:$CO$47,2,0),0)","v":4196},"N° viajes",null,null,null,null,null,null,null,",",null,null,null,null,{"$f":"SUM(F192:Q192)","v":0},{"$f":"COUNT(F192:Q192)","v":0},{"$f":"IFERROR(VLOOKUP(C192,'[1]FACTORES DE EMISIÓN'!$CN$4:$CP$47,3,0),0)","v":303.5},"kg CO2/trayecto",{"$f":"IFERROR((R192*T192)/1000,0)","v":0}]
[null,"BOGOTÁ, COLOMBIA (BOG)","BOSTON,MA,UNST (BOS)",{"$f":"IFERROR(VLOOKUP(C193,'[1]FACTORES DE EMISIÓN'!$CN$4:$CO$47,2,0),0)","v":4196},"N° viajes",null,null,null,null,null,null,null,null,null,null,null,null,{"$f":"SUM(F193:Q193)","v":0},{"$f":"COUNT(F193:Q193)","v":0},{"$f":"IFERROR(VLOOKUP(C193,'[1]FACTORES DE EMISIÓN'!$CN$4:$CP$47,3,0),0)","v":303.5},"kg CO2/trayecto",{"$f":"IFERROR((R193*T193)/1000,0)","v":0}]
[null,"TOTAL EMISIONES",null,null,null,null,null,null,null,null,null,null,null,null,null,null,null,null,null,null,null,{"$f":"SUM(V189:V193)","v":0}]
[]
[]
["VIAJES AÉREOS INTERNACIONALES"]
[2021,"ORIGEN","DESTINO","DISTANCIA (km)","UNIDAD","NÚMERO DE VIAJES",null,null,null,null,null,null,null,null,null,null,null,null,"No. DE DATOS","FACTOR DE EMISIÓN ","UNIDADES DEL FACTOR","HUELLA DE CARBONO \n(TON CO2)"]
[null,null,null,null,null,"ENE","FEB","MAR","ABR","MAY","JUN","JUL","AGO","SEP","OCT","NOV","DIC","TOTAL"]
[null,null,"Escoja la opción que corresponda",null,null,"Digite la cantidad de viajes por cada trayecto"]
[null,"BOGOTÁ, COLOMBIA (BOG)","BOSTON,MA,UNST (BOS)",{"$f":"IFERROR(VLOOKUP(C201,'[1]FACTORES DE EMISIÓN'!$CN$4:$CO$47,2,0),0)","v":4196},"N° viajes",null,null,null,null,null,null,null,null,null,null,null,null,{"$f":"SUM(F201:Q201)","v":0},{"$f":"COUNT(F201:Q201)","v":0},{"$f":"IFERROR(VLOOKUP(C201,'[1]FACTORES DE EMISIÓN'!$CN$4:$CP$47,3,0),0)","v":303.5},"kg CO2/trayecto",{"$f":"IFERROR((R201*T201)/1000,0)","v":0}]
[null,"BOGOTÁ, COLOMBIA (BOG)","BOSTON,MA,UNST (BOS)",{"$f":"IFERROR(VLOOKUP(C202,'[1]FACTORES DE EMISIÓN'!$CN$4:$CO$47,2,0),0)","v":4196},"N° viajes",null,null,null,null,null,null,null,null,null,null,null,null,{"$f":"SUM(F202:Q202)","v":0},{"$f":"COUNT(F202:Q202)","v":0},{"$f":"IFERROR(VLOOKUP(C202,'[1]FACTORES DE EMISIÓN'!$CN$4:$CP$47,3,0),0)","v":303.5},"kg CO2/trayecto",{"$f":"IFERROR((R202*T202)/1000,0)","v":0}]
[null,"BOGOTÁ, COLOMBIA (BOG)","BOSTON,MA,UNST (BOS)",{"$f":"IFERROR(VLOOKUP(C203,'[1]FACTORES DE EMISIÓN'!$CN$4:$CO$47,2,0),0)","v":4196},"N° viajes",null,null,null,null,null,null,null,null,null,null,null,null,{"$f":"SUM(F203:Q203)","v":0},{"$f":"COUNT(F203:Q203)","v":0},{"$f":"IFERROR(VLOOKUP(C203,'[1]FACTORES DE EMISIÓN'!$CN$4:$CP$47,3,0),0)","v":303.5},"kg CO2/trayecto",{"$f":"IFERROR((R203*T203)/1000,0)","v":0}]
[null,"BOGOTÁ, COLOMBIA (BOG)","BOSTON,MA,UNST (BOS)",{"$f":"IFERROR(VLOOKUP(C204,'[1]FACTORES DE EMISIÓN'!$CN$4:$CO$47,2,0),0)","v":4196},"N° viajes",null,null,null,null,null,null,null,",",null,null,null,null,{"$f":"SUM(F204:Q204)","v":0},{"$f":"COUNT(F204:Q204)","v":0},{"$f":"IFERROR(VLOOKUP(C204,'[1]FACTORES DE EMISIÓN'!$CN$4:$CP$47,3,0),0)","v":303.5},"kg CO2/trayecto",{"$f":"IFERROR((R204*T204)/1000,0)","v":0}]
[null,"BOGOTÁ, COLOMBIA (BOG)","BOSTON,MA,UNST (BOS)",{"$f":"IFERROR(VLOOKUP(C205,'[1]FACTORES DE EMISIÓN'!$CN$4:$CO$47,2,0),0)","v":4196},"N° viajes",null,null,null,null,null,null,null,null,null,null,null,null,{"$f":"SUM(F205:Q205)","v":0},{"$f":"COUNT(F205:Q205)","v":0},{"$f":"IFERROR(VLOOKUP(C205,'[1]FACTORES DE EMISIÓN'!$CN$4:$CP$47,3,0),0)","v":303.5},"kg CO2/trayecto",{"$f":"IFERROR((R205*T205)/1000,0)","v":0}]
[null,"TOTAL EMISIONES",null,null,null,null,null,null,null,null,null,null,null,null,null,null,null,null,null,null,null,{"$f":"SUM(V201:V205)","v":0}]
[]
["OTRAS FUENTES DE EMISIÓN"]
[2017,"FUENTE DE EMISIÓN",null,"UNIDAD EN LA CUAL DEBE INGRESAR LA INFORMACIÓN",null,"CONSUMO DE ACUERDO A LA UNIDAD SOICITADA",null,null,null,null,null,null,null,null,null,null,null,null,"No. DE DATOS","FACTOR DE EMISIÓN ","UNIDADES DEL FACTOR","HUELLA DE CARBONO \n(TON CO2)"]
[null,null,null,null,null,"ENE","FEB","MAR","ABR","MAY","JUN","JUL","AGO","SEP","OCT","NOV","DIC","TOTAL"]
[null,"Escoja la opción que corresponda",null,null,null,"Digite el valor de la unidad asociada a la fuente de emisión elegida"]
[null,"Polietileno de baja densidad ",null,{"$f":"+VLOOKUP(B21:B212,'[1]FACTORES DE EMISIÓN'!$CA$4:$CE$37,2,FALSE)","v":"kg"},null,null,null,null,null,null,null,null,null,null,null,null,null,{"$f":"SUM(F212:Q212)","v":0},{"$f":"COUNT(F212:Q212)","v":0},{"$f":"+VLOOKUP(B21:B212,'[1]FACTORES DE EMISIÓN'!$CA$4:$CE$37,5,FALSE)","v":2.08},{"$f":"+VLOOKUP(B212,'FACTORES DE EMISIÓN '!$CA$4:$CE$37,4,FALSE)","v":"kgCO2 e/kg"},{"$f":"IFERROR((R212*T212)/1000,0)","v":0}]
[null,"Papel brillante de revista",null,{"$f":"+VLOOKUP(B22:B213,'[1]FACTORES DE EMISIÓN'!$CA$4:$CE$37,2,FALSE)","v":"kg"},null,null,null,null,null,null,null,null,null,null,null,null,null,{"$f":"SUM(F213:Q213)","v":0},{"$f":"COUNT(F213:Q213)","v":0},{"$f":"+VLOOKUP(B22:B213,'[1]FACTORES DE EMISIÓN'!$CA$4:$CE$37,5,FALSE)","v":1.39},{"$f":"+VLOOKUP(B213,'FACTORES DE EMISIÓN '!$CA$4:$CE$37,4,FALSE)","v":"kgCO2 e/kg"},{"$f":"IFERROR((R213*T213)/1000,0)","v":0}]
[null,"Papel mate de revista",null,{"$f":"+VLOOKUP(B23:B214,'[1]FACTORES DE EMISIÓN'!$CA$4:$CE$37,2,FALSE)","v":"kg"},null,null,null,null,null,null,null,null,null,null,null,null,null,{"$f":"SUM(F214:Q214)","v":0},{"$f":"COUNT(F214:Q214)","v":0},{"$f":"+VLOOKUP(B23:B214,'[1]FACTORES DE EMISIÓN'!$CA$4:$CE$37,5,FALSE)","v":0.83},{"$f":"+VLOOKUP(B214,'FACTORES DE EMISIÓN '!$CA$4:$CE$37,4,FALSE)","v":"kgCO2 e/kg"},{"$f":"IFERROR((R214*T214)/1000,0)","v":0}]
[null,"Polipropileno ",null,{"$f":"+VLOOKUP(B24:B215,'[1]FACTORES DE EMISIÓN'!$CA$4:$CE$37,2,FALSE)","v":"kg"},null,null,null,null,null,null,null,null,",",null,null,null,null,{"$f":"SUM(F215:Q215)","v":0},{"$f":"COUNT(F215:Q215)","v":0},{"$f":"+VLOOKUP(B24:B215,'[1]FACTORES DE EMISIÓN'!$CA$4:$CE$37,5,FALSE)","v":2.89},{"$f":"+VLOOKUP(B215,'FACTORES DE EMISIÓN '!$CA$4:$CE$37,4,FALSE)","v":"kgCO2 e/kg"},{"$f":"IFERROR((R215*T215)/1000,0)","v":0}]
[null,"Residuos solidos pulpa y papel a relleno sanitario anaeróbico",null,{"$f":"+VLOOKUP(B25:B216,'[1]FACTORES DE EMISIÓN'!$CA$4:$CE$37,2,FALSE)","v":"kg húmedo"},null,null,null,null,null,null,null,null,null,null,null,null,null,{"$f":"SUM(F216:Q216)","v":0},{"$f":"COUNT(F216:Q216)","v":0},{"$f":"+VLOOKUP(B25:B216,'[1]FACTORES DE EMISIÓN'!$CA$4:$CE$37,5,FALSE)","v":3.7333333333333334},{"$f":"+VLOOKUP(B216,'FACTORES DE EMISIÓN '!$CA$4:$CE$37,4,FALSE)","v":"kgCO2/kg húmedo"},{"$f":"IFERROR((R216*T216)/1000,0)","v":0}]
[null,"TOTAL EMISIONES",null,null,null,null,null,null,null,null,null,null,null,null,null,null,null,null,null,null,null,{"$f":"SUM(V212:V216)","v":0}]
[]
["OTRAS FUENTES DE EMISIÓN"]
[2018,"FUENTE DE EMISIÓN",null,"UNIDAD EN LA CUAL DEBE INGRESAR LA INFORMACIÓN",null,"CONSUMO DE ACUERDO A LA UNIDAD SOICITADA",null,null,null,null,null,null,null,null,null,null,null,null,"No. DE DATOS","FACTOR DE EMISIÓN ","UNIDADES DEL FACTOR","HUELLA DE CARBONO \n(TON CO2)"]
[null,null,null,null,null,"ENE","FEB","MAR","ABR","MAY","JUN","JUL","AGO","SEP","OCT","NOV","DIC","TOTAL"]
[null,"Escoja la opción que corresponda",null,null,null,"Digite el valor de la unidad asociada a la fuente de emisión elegida"]
[null,"Papel bond blanco",null,{"$f":"+VLOOKUP(B32:B223,'[1]FACTORES DE EMISIÓN'!$CA$4:$CE$37,2,FALSE)","v":"kg"},null,null,null,null,null,null,null,null,null,null,null,null,null,{"$f":"SUM(F223:Q223)","v":0},{"$f":"COUNT(F223:Q223)","v":0},{"$f":"+VLOOKUP(B32:B223,'[1]FACTORES DE EMISIÓN'!$CA$4:$CE$37,5,FALSE)","v":1.05},{"$f":"+VLOOKUP(B223,'FACTORES DE EMISIÓN '!$CA$4:$CE$37,4,FALSE)","v":"kgCO2 e/kg"},{"$f":"IFERROR((R223*T223)/1000,0)","v":0}]
[null,null,null,{"$f":"+VLOOKUP(B33:B224,'[1]FACTORES DE EMISIÓN'!$CA$4:$CE$37,2,FALSE)","v":{"$error":"#N/A"}},null,null,null,null,null,null,null,null,null,null,null,null,null,{"$f":"SUM(F224:Q224)","v":0},{"$f":"COUNT(F224:Q224)","v":0},{"$f":"+VLOOKUP(B33:B224,'[1]FACTORES DE EMISIÓN'!$CA$4:$CE$37,5,FALSE)","v":{"$error":"#N/A"}},{"$f":"+VLOOKUP(B224,'FACTORES DE EMISIÓN '!$CA$4:$CE$37,4,FALSE)","v":{"$error":"#N/A"}},{"$f":"IFERROR((R224*T224)/1000,0)","v":0}]
[null,null,null,{"$f":"+VLOOKUP(B34:B225,'[1]FACTORES DE EMISIÓN'!$CA$4:$CE$37,2,FALSE)","v":{"$error":"#N/A"}},null,null,null,null,null,null,null,null,null,null,null,null,null,{"$f":"SUM(F225:Q225)","v":0},{"$f":"COUNT(F225:Q225)","v":0},{"$f":"+VLOOKUP(B34:B225,'[1]FACTORES DE EMISIÓN'!$CA$4:$CE$37,5,FALSE)","v":{"$error":"#N/A"}},{"$f":"+VLOOKUP(B225,'FACTORES DE EMISIÓN '!$CA$4:$CE$37,4,FALSE)","v":{"$error":"#N/A"}},{"$f":"IFERROR((R225*T225)/1000,0)","v":0}]
[null,"Polietileno de alta densidad ",null,{"$f":"+VLOOKUP(B35:B226,'[1]FACTORES DE EMISIÓN'!$CA$4:$CE$37,2,FALSE)","v":"kg"},null,null,null,null,null,null,null,null,",",null,null,null,null,{"$f":"SUM(F226:Q226)","v":0},{"$f":"COUNT(F226:Q226)","v":0},{"$f":"+VLOOKUP(B35:B226,'[1]FACTORES DE EMISIÓN'!$CA$4:$CE$37,5,FALSE)","v":2.87},{"$f":"+VLOOKUP(B226,'FACTORES DE EMISIÓN '!$CA$4:$CE$37,4,FALSE)","v":"kgCO2 e/kg"},{"$f":"IFERROR((R226*T226)/1000,0)","v":0}]
[null,null,null,{"$f":"+VLOOKUP(B36:B227,'[1]FACTORES DE EMISIÓN'!$CA$4:$CE$37,2,FALSE)","v":{"$error":"#N/A"}},null,null,null,null,null,null,null,null,null,null,null,null,null,{"$f":"SUM(F227:Q227)","v":0},{"$f":"COUNT(F227:Q227)","v":0},{"$f":"+VLOOKUP(B36:B227,'[1]FACTORES DE EMISIÓN'!$CA$4:$CE$37,5,FALSE)","v":{"$error":"#N/A"}},{"$f":"+VLOOKUP(B227,'FACTORES DE EMISIÓN '!$CA$4:$CE$37,4,FALSE)","v":{"$error":"#N/A"}},{"$f":"IFERROR((R227*T227)/1000,0)","v":0}]
[null,"TOTAL EMISIONES",null,null,null,null,null,null,null,null,null,null,null,null,null,null,null,null,null,null,null,{"$f":"SUM(V223:V227)","v":0}]
[]
["OTRAS FUENTES DE EMISIÓN"]
[2019,"FUENTE DE EMISIÓN",null,"UNIDAD EN LA CUAL DEBE INGRESAR LA INFORMACIÓN",null,"CONSUMO DE ACUERDO A LA UNIDAD SOICITADA",null,null,null,null,null,null,null,null,null,null,null,null,"No. DE DATOS","FACTOR DE EMISIÓN ","UNIDADES DEL FACTOR","HUELLA DE CARBONO \n(TON CO2)"]
[null,null,null,null,null,"ENE","FEB","MAR","ABR","MAY","JUN","JUL","AGO","SEP","OCT","NOV","DIC","TOTAL"]
[null,"Escoja la opción que corresponda",null,null,null,"Digite el valor de la unidad asociada a la fuente de emisión elegida"]
[null,"Polietileno de baja densidad ",null,{"$f":"+VLOOKUP(B43:B234,'[1]FACTORES DE EMISIÓN'!$CA$4:$CE$37,2,FALSE)","v":"kg"},null,null,null,null,null,null,null,null,null,null,null,null,null,{"$f":"SUM(F234:Q234)","v":0},{"$f":"COUNT(F234:Q234)","v":0},{"$f":"+VLOOKUP(B43:B234,'[1]FACTORES DE EMISIÓN'!$CA$4:$CE$37,5,FALSE)","v":2.08},{"$f":"+VLOOKUP(B234,'FACTORES DE EMISIÓN '!$CA$4:$CE$37,4,FALSE)","v":"kgCO2 e/kg"},{"$f":"IFERROR((R234*T234)/1000,0)","v":0}]
[null,"Incineración controlada residuos solidos industriales ",null,{"$f":"+VLOOKUP(B44:B235,'[1]FACTORES DE EMISIÓN'!$CA$4:$CE$37,2,FALSE)","v":"kg res. húmedo"},null,null,null,null,null,null,null,null,null,null,null,null,null,{"$f":"SUM(F235:Q235)","v":0},{"$f":"COUNT(F235:Q235)","v":0},{"$f":"+VLOOKUP(B44:B235,'[1]FACTORES DE EMISIÓN'!$CA$4:$CE$37,5,FALSE)","v":0.182},{"$f":"+VLOOKUP(B235,'FACTORES DE EMISIÓN '!$CA$4:$CE$37,4,FALSE)","v":"kgCO2/kg húmedo"},{"$f":"IFERROR((R235*T235)/1000,0)","v":0}]
[null,null,null,{"$f":"+VLOOKUP(B45:B236,'[1]FACTORES DE EMISIÓN'!$CA$4:$CE$37,2,FALSE)","v":{"$error":"#N/A"}},null,null,null,null,null,null,null,null,null,null,null,null,null,{"$f":"SUM(F236:Q236)","v":0},{"$f":"COUNT(F236:Q236)","v":0},{"$f":"+VLOOKUP(B45:B236,'[1]FACTORES DE EMISIÓN'!$CA$4:$CE$37,5,FALSE)","v":{"$error":"#N/A"}},{"$f":"+VLOOKUP(B236,'FACTORES DE EMISIÓN '!$CA$4:$CE$37,4,FALSE)","v":{"$error":"#N/A"}},{"$f":"IFERROR((R236*T236)/1000,0)","v":0}]
[null,null,null,{"$f":"+VLOOKUP(B46:B237,'[1]FACTORES DE EMISIÓN'!$CA$4:$CE$37,2,FALSE)","v":{"$error":"#N/A"}},null,null,null,null,null,null,null,null,",",null,null,null,null,{"$f":"SUM(F237:Q237)","v":0},{"$f":"COUNT(F237:Q237)","v":0},{"$f":"+VLOOKUP(B46:B237,'[1]FACTORES DE EMISIÓN'!$CA$4:$CE$37,5,FALSE)","v":{"$error":"#N/A"}},{"$f":"+VLOOKUP(B237,'FACTORES DE EMISIÓN '!$CA$4:$CE$37,4,FALSE)","v":{"$error":"#N/A"}},{"$f":"IFERROR((R237*T237)/1000,0)","v":0}]
[null,null,null,{"$f":"+VLOOKUP(B47:B238,'[1]FACTORES DE EMISIÓN'!$CA$4:$CE$37,2,FALSE)","v":{"$error":"#N/A"}},null,null,null,null,null,null,null,null,null,null,null,null,null,{"$f":"SUM(F238:Q238)","v":0},{"$f":"COUNT(F238:Q238)","v":0},{"$f":"+VLOOKUP(B47:B238,'[1]FACTORES DE EMISIÓN'!$CA$4:$CE$37,5,FALSE)","v":{"$error":"#N/A"}},{"$f":"+VLOOKUP(B238,'FACTORES DE EMISIÓN '!$CA$4:$CE$37,4,FALSE)","v":{"$error":"#N/A"}},{"$f":"IFERROR((R238*T238)/1000,0)","v":0}]
[null,"TOTAL EMISIONES",null,null,null,null,null,null,null,null,null,null,null,null,null,null,null,null,null,null,null,{"$f":"SUM(V234:V238)","v":0}]
[]
["OTRAS FUENTES DE EMISIÓN"]
[2020,"FUENTE DE EMISIÓN",null,"UNIDAD EN LA CUAL DEBE INGRESAR LA INFORMACIÓN",null,"CONSUMO DE ACUERDO A LA UNIDAD SOICITADA",null,null,null,null,null,null,null,null,null,null,null,null,"No. DE DATOS","FACTOR DE EMISIÓN ","UNIDADES DEL FACTOR","HUELLA DE CARBONO \n(TON CO2)"]
[null,null,null,null,null,"ENE","FEB","MAR","ABR","MAY","JUN","JUL","AGO","SEP","OCT","NOV","DIC","TOTAL"]
[null,"Escoja la opción que corresponda",null,null,null,"Digite el valor de la unidad asociada a la fuente de emisión elegida"]
[null,"Polietileno de baja densidad ",null,{"$f":"+VLOOKUP(B54:B245,'[1]FACTORES DE EMISIÓN'!$CA$4:$CE$37,2,FALSE)","v":"kg"},null,null,null,null,null,null,null,null,null,null,null,null,null,{"$f":"SUM(F245:Q245)","v":0},{"$f":"COUNT(F245:Q245)","v":0},{"$f":"+VLOOKUP(B54:B245,'[1]FACTORES DE EMISIÓN'!$CA$4:$CE$37,5,FALSE)","v":2.08},{"$f":"+VLOOKUP(B245,'FACTORES DE EMISIÓN '!$CA$4:$CE$37,4,FALSE)","v":"kgCO2 e/kg"},{"$f":"IFERROR((R245*T245)/1000,0)","v":0}]
[null,"Tratamiento de lodos orgánicos industriales",null,{"$f":"+VLOOKUP(B55:B246,'[1]FACTORES DE EMISIÓN'!$CA$4:$CE$37,2,FALSE)","v":"kg DQO"},null,null,null,null,null,null,null,null,null,null,null,null,null,{"$f":"SUM(F246:Q246)","v":0},{"$f":"COUNT(F246:Q246)","v":0},{"$f":"+VLOOKUP(B55:B246,'[1]FACTORES DE EMISIÓN'!$CA$4:$CE$37,5,FALSE)","v":5.6000000000000005},{"$f":"+VLOOKUP(B246,'FACTORES DE EMISIÓN '!$CA$4:$CE$37,4,FALSE)","v":"kgCO2/kg DQO"},{"$f":"IFERROR((R246*T246)/1000,0)","v":0}]
[null,null,null,{"$f":"+VLOOKUP(B56:B247,'[1]FACTORES DE EMISIÓN'!$CA$4:$CE$37,2,FALSE)","v":{"$error":"#N/A"}},null,null,null,null,null,null,null,null,null,null,null,null,null,{"$f":"SUM(F247:Q247)","v":0},{"$f":"COUNT(F247:Q247)","v":0},{"$f":"+VLOOKUP(B56:B247,'[1]FACTORES DE EMISIÓN'!$CA$4:$CE$37,5,FALSE)","v":{"$error":"#N/A"}},{"$f":"+VLOOKUP(B247,'FACTORES DE EMISIÓN '!$CA$4:$CE$37,4,FALSE)","v":{"$error":"#N/A"}},{"$f":"IFERROR((R247*T247)/1000,0)","v":0}]
[null,null,null,{"$f":"+VLOOKUP(B57:B248,'[1]FACTORES DE EMISIÓN'!$CA$4:$CE$37,2,FALSE)","v":{"$error":"#N/A"}},null,null,null,null,null,null,null,null,",",null,null,null,null,{"$f":"SUM(F248:Q248)","v":0},{"$f":"COUNT(F248:Q248)","v":0},{"$f":"+VLOOKUP(B57:B248,'[1]FACTORES DE EMISIÓN'!$CA$4:$CE$37,5,FALSE)","v":{"$error":"#N/A"}},{"$f":"+VLOOKUP(B248,'FACTORES DE EMISIÓN '!$CA$4:$CE$37,4,FALSE)","v":{"$error":"#N/A"}},{"$f":"IFERROR((R248*T248)/1000,0)","v":0}]
[null,null,null,{"$f":"+VLOOKUP(B58:B249,'[1]FACTORES DE EMISIÓN'!$CA$4:$CE$37,2,FALSE)","v":{"$error":"#N/A"}},null,null,null,null,null,null,null,null,null,null,null,null,null,{"$f":"SUM(F249:Q249)","v":0},{"$f":"COUNT(F249:Q249)","v":0},{"$f":"+VLOOKUP(B58:B249,'[1]FACTORES DE EMISIÓN'!$CA$4:$CE$37,5,FALSE)","v":{"$error":"#N/A"}},{"$f":"+VLOOKUP(B249,'FACTORES DE EMISIÓN '!$CA$4:$CE$37,4,FALSE)","v":{"$error":"#N/A"}},{"$f":"IFERROR((R249*T249)/1000,0)","v":0}]
[null,"TOTAL EMISIONES",null,null,null,null,null,null,null,null,null,null,null,null,null,null,null,null,null,null,null,{"$f":"SUM(V245:V249)","v":0}]
[]
["OTRAS FUENTES DE EMISIÓN"]
[2021,"FUENTE DE EMISIÓN",null,"UNIDAD EN LA CUAL DEBE INGRESAR LA INFORMACIÓN",null,"CONSUMO DE ACUERDO A LA UNIDAD SOICITADA",null,null,null,null,null,null,null,null,null,null,null,null,"No. DE DATOS","FACTOR DE EMISIÓN ","UNIDADES DEL FACTOR","HUELLA DE CARBONO \n(TON CO2)"]
[null,null,null,null,null,"ENE","FEB","MAR","ABR","MAY","JUN","JUL","AGO","SEP","OCT","NOV","DIC","TOTAL"]
[null,"Escoja la opción que corresponda",null,null,null,"Digite el valor de la unidad asociada a la fuente de emisión elegida"]
[null,"Polietileno de baja densidad ",null,{"$f":"+VLOOKUP(B65:B256,'[1]FACTORES DE EMISIÓN'!$CA$4:$CE$37,2,FALSE)","v":"kg"},null,null,null,null,null,null,null,null,null,null,null,null,null,{"$f":"SUM(F256:Q256)","v":0},{"$f":"COUNT(F256:Q256)","v":0},{"$f":"+VLOOKUP(B65:B256,'[1]FACTORES DE EMISIÓN'!$CA$4:$CE$37,5,FALSE)","v":2.08},{"$f":"+VLOOKUP(B256,'FACTORES DE EMISIÓN '!$CA$4:$CE$37,4,FALSE)","v":"kgCO2 e/kg"},{"$f":"IFERROR((R256*T256)/1000,0)","v":0}]
[null,"Incineración controlada residuos solidos industriales ",null,{"$f":"+VLOOKUP(B66:B257,'[1]FACTORES DE EMISIÓN'!$CA$4:$CE$37,2,FALSE)","v":"kg res. húmedo"},null,null,null,null,null,null,null,null,null,null,null,null,null,{"$f":"SUM(F257:Q257)","v":0},{"$f":"COUNT(F257:Q257)","v":0},{"$f":"+VLOOKUP(B66:B257,'[1]FACTORES DE EMISIÓN'!$CA$4:$CE$37,5,FALSE)","v":0.182},{"$f":"+VLOOKUP(B257,'FACTORES DE EMISIÓN '!$CA$4:$CE$37,4,FALSE)","v":"kgCO2/kg húmedo"},{"$f":"IFERROR((R257*T257)/1000,0)","v":0}]
[null,"Incineración controlada residuos líquidos industriales",null,{"$f":"+VLOOKUP(B67:B258,'[1]FACTORES DE EMISIÓN'!$CA$4:$CE$37,2,FALSE)","v":"kg res. húmedo"},null,null,null,null,null,null,null,null,null,null,null,null,null,{"$f":"SUM(F258:Q258)","v":0},{"$f":"COUNT(F258:Q258)","v":0},{"$f":"+VLOOKUP(B67:B258,'[1]FACTORES DE EMISIÓN'!$CA$4:$CE$37,5,FALSE)","v":2.7159999999999999E-4},{"$f":"+VLOOKUP(B258,'FACTORES DE EMISIÓN '!$CA$4:$CE$37,4,FALSE)","v":"kgCO2/kg húmedo"},{"$f":"IFERROR((R258*T258)/1000,0)","v":0}]
[null,null,null,{"$f":"+VLOOKUP(B68:B259,'[1]FACTORES DE EMISIÓN'!$CA$4:$CE$37,2,FALSE)","v":{"$error":"#N/A"}},null,null,null,null,null,null,null,null,",",null,null,null,null,{"$f":"SUM(F259:Q259)","v":0},{"$f":"COUNT(F259:Q259)","v":0},{"$f":"+VLOOKUP(B68:B259,'[1]FACTORES DE EMISIÓN'!$CA$4:$CE$37,5,FALSE)","v":{"$error":"#N/A"}},{"$f":"+VLOOKUP(B259,'FACTORES DE EMISIÓN '!$CA$4:$CE$37,4,FALSE)","v":{"$error":"#N/A"}},{"$f":"IFERROR((R259*T259)/1000,0)","v":0}]
[null,null,null,{"$f":"+VLOOKUP(B69:B260,'[1]FACTORES DE EMISIÓN'!$CA$4:$CE$37,2,FALSE)","v":{"$error":"#N/A"}},null,null,null,null,null,null,null,null,null,null,null,null,null,{"$f":"SUM(F260:Q260)","v":0},{"$f":"COUNT(F260:Q260)","v":0},{"$f":"+VLOOKUP(B69:B260,'[1]FACTORES DE EMISIÓN'!$CA$4:$CE$37,5,FALSE)","v":{"$error":"#N/A"}},{"$f":"+VLOOKUP(B260,'FACTORES DE EMISIÓN '!$CA$4:$CE$37,4,FALSE)","v":{"$error":"#N/A"}},{"$f":"IFERROR((R260*T260)/1000,0)","v":0}]
[null,"TOTAL EMISIONES",null,null,null,null,null,null,null,null,null,null,null,null,null,null,null,null,null,null,null,{"$f":"SUM(V256:V260)","v":0}]
[null,"Papel bond blanco",null,{"$f":"IFERROR(VLOOKUP(B262,'[2]FACTORES DE EMISIÓN'!$CA$4:CB488,2,0),0)","v":"kg"},null,null,null,null,null,null,null,null,null,null,null,null,null,{"$f":"SUM(F262:Q262)","v":0},{"$f":"COUNT(F262:Q262)","v":0},{"$f":"IFERROR(VLOOKUP(B262,'[2]FACTORES DE EMISIÓN'!$CA$4:$CG$37,5,0),0)","v":1.05},{"$f":"IFERROR(VLOOKUP(B262,'[2]FACTORES DE EMISIÓN'!$CA$4:$CG$37,6,0),0)","v":"Silva D., Raymundo A., Oliveira J., Ometto A., 2015. Life cycle assessment of offset paper production in Brazil: hotspots and cleaner production alternatives. Journal of cleaner Production. (93) 222-233"},{"$f":"IFERROR((R262*T262)/1000,0)","v":0}]
[null,null,null,{"$f":"IFERROR(VLOOKUP(B263,'[2]FACTORES DE EMISIÓN'!$CA$4:CB489,2,0),0)","v":0},null,null,null,null,null,null,null,null,null,null,null,null,null,{"$f":"SUM(F263:Q263)","v":0},{"$f":"COUNT(F263:Q263)","v":0},{"$f":"IFERROR(VLOOKUP(B263,'[2]FACTORES DE EMISIÓN'!$CA$4:$CG$37,5,0),0)","v":0},{"$f":"IFERROR(VLOOKUP(B263,'[2]FACTORES DE EMISIÓN'!$CA$4:$CG$37,6,0),0)","v":0},{"$f":"IFERROR((R263*T263)/1000,0)","v":0}]
[null,null,null,{"$f":"IFERROR(VLOOKUP(B264,'[2]FACTORES DE EMISIÓN'!$CA$4:CB490,2,0),0)","v":0},null,null,null,null,null,null,null,null,null,null,null,null,null,{"$f":"SUM(F264:Q264)","v":0},{"$f":"COUNT(F264:Q264)","v":0},{"$f":"IFERROR(VLOOKUP(B264,'[2]FACTORES DE EMISIÓN'!$CA$4:$CG$37,5,0),0)","v":0},{"$f":"IFERROR(VLOOKUP(B264,'[2]FACTORES DE EMISIÓN'!$CA$4:$CG$37,6,0),0)","v":0},{"$f":"IFERROR((R264*T264)/1000,0)","v":0}]
[null,null,null,{"$f":"IFERROR(VLOOKUP(B265,'[2]FACTORES DE EMISIÓN'!$CA$4:CB491,2,0),0)","v":0},null,null,null,null,null,null,null,null,",",null,null,null,null,{"$f":"SUM(F265:Q265)","v":0},{"$f":"COUNT(F265:Q265)","v":0},{"$f":"IFERROR(VLOOKUP(B265,'[2]FACTORES DE EMISIÓN'!$CA$4:$CG$37,5,0),0)","v":0},{"$f":"IFERROR(VLOOKUP(B265,'[2]FACTORES DE EMISIÓN'!$CA$4:$CG$37,6,0),0)","v":0},{"$f":"IFERROR((R265*T265)/1000,0)","v":0}]
[null,null,null,{"$f":"IFERROR(VLOOKUP(B266,'[2]FACTORES DE EMISIÓN'!$CA$4:CB492,2,0),0)","v":0},null,null,null,null,null,null,null,null,null,null,null,null,null,{"$f":"SUM(F266:Q266)","v":0},{"$f":"COUNT(F266:Q266)","v":0},{"$f":"IFERROR(VLOOKUP(B266,'[2]FACTORES DE EMISIÓN'!$CA$4:$CG$37,5,0),0)","v":0},{"$f":"IFERROR(VLOOKUP(B266,'[2]FACTORES DE EMISIÓN'!$CA$4:$CG$37,6,0),0)","v":0},{"$f":"IFERROR((R266*T266)/1000,0)","v":0}]
[null,"TOTAL EMISIONES",null,null,null,null,null,null,null,null,null,null,null,null,null,null,null,null,null,null,null,{"$f":"SUM(V262:V266)","v":0}]
[null,null,"DESTINO","DISTANCIA (km)","UNIDAD","NÚMERO DE VIAJES",null,null,null,null,null,null,null,null,null,null,null,null,"No. DE DATOS","FACTOR DE EMISIÓN ","UNIDADES DEL FACTOR","HUELLA DE CARBONO \n(TON CO2)"]
[null,null,null,null,null,"ENE","FEB","MAR","ABR","MAY","JUN","JUL","AGO","SEP","OCT","NOV","DIC","TOTAL"]
[null,null,"Escoja la opción que corresponda",null,null,"Digite la cantidad de viajes por cada trayecto"]
[null,null,null,{"$f":"IFERROR(VLOOKUP(C271,'[1]FACTORES DE EMISIÓN'!$CN$4:$CO$47,2,0),0)","v":0},"N° viajes",null,null,null,null,null,null,null,null,null,null,null,null,{"$f":"SUM(F271:Q271)","v":0},{"$f":"COUNT(F271:Q271)","v":0},{"$f":"IFERROR(VLOOKUP(C271,'[1]FACTORES DE EMISIÓN'!$CN$4:$CP$47,3,0),0)","v":0},"kg CO2/trayecto",{"$f":"IFERROR((R271*T271)/1000,0)","v":0}]
[null,null,null,{"$f":"IFERROR(VLOOKUP(C272,'[1]FACTORES DE EMISIÓN'!$CN$4:$CO$47,2,0),0)","v":0},"N° viajes",null,null,null,null,null,null,null,null,null,null,null,null,{"$f":"SUM(F272:Q272)","v":0},{"$f":"COUNT(F272:Q272)","v":0},{"$f":"IFERROR(VLOOKUP(C272,'[1]FACTORES DE EMISIÓN'!$CN$4:$CP$47,3,0),0)","v":0},"kg CO2/trayecto",{"$f":"IFERROR((R272*T272)/1000,0)","v":0}]
[null,"TOTAL EMISIONES",null,{"$f":"IFERROR(VLOOKUP(C273,'[1]FACTORES DE EMISIÓN'!$CN$4:$CO$47,2,0),0)","v":0},"N° viajes",null,null,null,null,null,null,null,null,null,null,null,null,{"$f":"SUM(F273:Q273)","v":0},{"$f":"COUNT(F273:Q273)","v":0},{"$f":"IFERROR(VLOOKUP(C273,'[1]FACTORES DE EMISIÓN'!$CN$4:$CP$47,3,0),0)","v":0},"kg CO2/trayecto",{"$f":"IFERROR((R273*T273)/1000,0)","v":0}]
[null,null,null,{"$f":"IFERROR(VLOOKUP(C274,'[1]FACTORES DE EMISIÓN'!$CN$4:$CO$47,2,0),0)","v":0},"N° viajes",null,null,null,null,null,null,null,",",null,null,null,null,{"$f":"SUM(F274:Q274)","v":0},{"$f":"COUNT(F274:Q274)","v":0},{"$f":"IFERROR(VLOOKUP(C274,'[1]FACTORES DE EMISIÓN'!$CN$4:$CP$47,3,0),0)","v":0},"kg CO2/trayecto",{"$f":"IFERROR((R274*T274)/1000,0)","v":0}]
[null,"ORIGEN",null,{"$f":"IFERROR(VLOOKUP(C275,'[1]FACTORES DE EMISIÓN'!$CN$4:$CO$47,2,0),0)","v":0},"N° viajes",null,null,null,null,null,null,null,null,null,null,null,null,{"$f":"SUM(F275:Q275)","v":0},{"$f":"COUNT(F275:Q275)","v":0},{"$f":"IFERROR(VLOOKUP(C275,'[1]FACTORES DE EMISIÓN'!$CN$4:$CP$47,3,0),0)","v":0},"kg CO2/trayecto",{"$f":"IFERROR((R275*T275)/1000,0)","v":0}]
[null,null,null,null,null,null,null,null,null,null,null,null,null,null,null,null,null,null,null,null,null,{"$f":"SUM(V271:V275)","v":0}]
[]
["OTRAS FUENTES DE EMISIÓN"]
[null,null,null,"UNIDAD EN LA CUAL DEBE INGRESAR LA INFORMACIÓN",null,"CONSUMO DE ACUERDO A LA UNIDAD SOICITADA",null,null,null,null,null,null,null,null,null,null,null,null,"No. DE DATOS","FACTOR DE EMISIÓN ","UNIDADES DEL FACTOR","HUELLA DE CARBONO \n(TON CO2)"]
[null,null,null,null,null,"ENE","FEB","MAR","ABR","MAY","JUN","JUL","AGO","SEP","OCT","NOV","DIC","TOTAL"]
[null,null,null,null,null,"Digite el valor de la unidad asociada a la fuente de emisión elegida"]
[null,null,null,{"$f":"IFERROR(VLOOKUP(B289,'[1]FACTORES DE EMISIÓN'!$CA$4:CB437,2,0),0)","v":"kg"},null,null,null,null,null,null,null,null,null,null,null,null,null,{"$f":"SUM(F282:Q282)","v":0},{"$f":"COUNT(F282:Q282)","v":0},{"$f":"IFERROR(VLOOKUP(B289,'[1]FACTORES DE EMISIÓN'!$CA$4:$CG$37,5,0),0)","v":1.39},{"$f":"IFERROR(VLOOKUP(B289,'[1]FACTORES DE EMISIÓN'!$CA$4:$CG$37,6,0),0)","v":"Leon J., Aliaga C., Boulougouris G., Hortal M., Marti J., 2015. Quantifying GHG emissions savings potential in magazine paper production: a case study on supercalendered and light-weight coated papers. Journal of Cleaner Production. (103) 301-308"},{"$f":"IFERROR((R282*T282)/1000,0)","v":0}]
[null,"TOTAL EMISIONES",null,{"$f":"IFERROR(VLOOKUP(B290,'[1]FACTORES DE EMISIÓN'!$CA$4:CB438,2,0),0)","v":0},null,null,null,null,null,null,null,null,null,null,null,null,null,{"$f":"SUM(F283:Q283)","v":0},{"$f":"COUNT(F283:Q283)","v":0},{"$f":"IFERROR(VLOOKUP(B290,'[1]FACTORES DE EMISIÓN'!$CA$4:$CG$37,5,0),0)","v":0},{"$f":"IFERROR(VLOOKUP(B290,'[1]FACTORES DE EMISIÓN'!$CA$4:$CG$37,6,0),0)","v":0},{"$f":"IFERROR((R283*T283)/1000,0)","v":0}]
[null,null,null,{"$f":"IFERROR(VLOOKUP(B291,'[1]FACTORES DE EMISIÓN'!$CA$4:CB439,2,0),0)","v":0},null,null,null,null,null,null,null,null,null,null,null,null,null,{"$f":"SUM(F284:Q284)","v":0},{"$f":"COUNT(F284:Q284)","v":0},{"$f":"IFERROR(VLOOKUP(B291,'[1]FACTORES DE EMISIÓN'!$CA$4:$CG$37,5,0),0)","v":0},{"$f":"IFERROR(VLOOKUP(B291,'[1]FACTORES DE EMISIÓN'!$CA$4:$CG$37,6,0),0)","v":0},{"$f":"IFERROR((R284*T284)/1000,0)","v":0}]
[null,null,null,{"$f":"IFERROR(VLOOKUP(B292,'[1]FACTORES DE EMISIÓN'!$CA$4:CB440,2,0),0)","v":0},null,null,null,null,null,null,null,null,",",null,null,null,null,{"$f":"SUM(F285:Q285)","v":0},{"$f":"COUNT(F285:Q285)","v":0},{"$f":"IFERROR(VLOOKUP(B292,'[1]FACTORES DE EMISIÓN'!$CA$4:$CG$37,5,0),0)","v":0},{"$f":"IFERROR(VLOOKUP(B292,'[1]FACTORES DE EMISIÓN'!$CA$4:$CG$37,6,0),0)","v":0},{"$f":"IFERROR((R285*T285)/1000,0)","v":0}]
[null,"FUENTE DE EMISIÓN",null,{"$f":"IFERROR(VLOOKUP(B293,'[1]FACTORES DE EMISIÓN'!$CA$4:CB441,2,0),0)","v":0},null,null,null,null,null,null,null,null,null,null,null,null,null,{"$f":"SUM(F286:Q286)","v":0},{"$f":"COUNT(F286:Q286)","v":0},{"$f":"IFERROR(VLOOKUP(B293,'[1]FACTORES DE EMISIÓN'!$CA$4:$CG$37,5,0),0)","v":0},{"$f":"IFERROR(VLOOKUP(B293,'[1]FACTORES DE EMISIÓN'!$CA$4:$CG$37,6,0),0)","v":0},{"$f":"IFERROR((R286*T286)/1000,0)","v":0}]
[null,null,null,null,null,null,null,null,null,null,null,null,null,null,null,null,null,null,null,null,null,{"$f":"SUM(V282:V286)","v":0}]
[null,"Escoja la opción que corresponda"]
[null,"Papel brillante de revista",null,"UNIDAD EN LA CUAL DEBE INGRESAR LA INFORMACIÓN",null,"CONSUMO DE ACUERDO A LA UNIDAD SOICITADA",null,null,null,null,null,null,null,null,null,null,null,null,"No. DE DATOS","FACTOR DE EMISIÓN ","UNIDADES DEL FACTOR","HUELLA DE CARBONO \n(TON CO2)"]
[null,null,null,null,null,"ENE","FEB","MAR","ABR","MAY","JUN","JUL","AGO","SEP","OCT","NOV","DIC","TOTAL"]
[null,null,null,null,null,"Digite el valor de la unidad asociada a la fuente de emisión elegida"]
[null,null,null,{"$f":"IFERROR(VLOOKUP(B299,'[1]FACTORES DE EMISIÓN'!$CA$4:CB447,2,0),0)","v":0},null,null,null,null,null,null,null,null,null,null,null,null,null,{"$f":"SUM(F292:Q292)","v":0},{"$f":"COUNT(F292:Q292)","v":0},{"$f":"IFERROR(VLOOKUP(B299,'[1]FACTORES DE EMISIÓN'!$CA$4:$CG$37,5,0),0)","v":0},{"$f":"IFERROR(VLOOKUP(B299,'[1]FACTORES DE EMISIÓN'!$CA$4:$CG$37,6,0),0)","v":0},{"$f":"IFERROR((R292*T292)/1000,0)","v":0}]
[null,null,null,{"$f":"IFERROR(VLOOKUP(B300,'[1]FACTORES DE EMISIÓN'!$CA$4:CB448,2,0),0)","v":0},null,null,null,null,null,null,null,null,null,null,null,null,null,{"$f":"SUM(F293:Q293)","v":0},{"$f":"COUNT(F293:Q293)","v":0},{"$f":"IFERROR(VLOOKUP(B300,'[1]FACTORES DE EMISIÓN'!$CA$4:$CG$37,5,0),0)","v":0},{"$f":"IFERROR(VLOOKUP(B300,'[1]FACTORES DE EMISIÓN'!$CA$4:$CG$37,6,0),0)","v":0},{"$f":"IFERROR((R293*T293)/1000,0)","v":0}]
[null,"TOTAL EMISIONES",null,{"$f":"IFERROR(VLOOKUP(B301,'[1]FACTORES DE EMISIÓN'!$CA$4:CB449,2,0),0)","v":0},null,null,null,null,null,null,null,null,null,null,null,null,null,{"$f":"SUM(F294:Q294)","v":0},{"$f":"COUNT(F294:Q294)","v":0},{"$f":"IFERROR(VLOOKUP(B301,'[1]FACTORES DE EMISIÓN'!$CA$4:$CG$37,5,0),0)","v":0},{"$f":"IFERROR(VLOOKUP(B301,'[1]FACTORES DE EMISIÓN'!$CA$4:$CG$37,6,0),0)","v":0},{"$f":"IFERROR((R294*T294)/1000,0)","v":0}]
[null,null,null,{"$f":"IFERROR(VLOOKUP(B302,'[1]FACTORES DE EMISIÓN'!$CA$4:CB450,2,0),0)","v":0},null,null,null,null,null,null,null,null,",",null,null,null,null,{"$f":"SUM(F295:Q295)","v":0},{"$f":"COUNT(F295:Q295)","v":0},{"$f":"IFERROR(VLOOKUP(B302,'[1]FACTORES DE EMISIÓN'!$CA$4:$CG$37,5,0),0)","v":0},{"$f":"IFERROR(VLOOKUP(B302,'[1]FACTORES DE EMISIÓN'!$CA$4:$CG$37,6,0),0)","v":0},{"$f":"IFERROR((R295*T295)/1000,0)","v":0}]
[null,"FUENTE DE EMISIÓN",null,{"$f":"IFERROR(VLOOKUP(B303,'[1]FACTORES DE EMISIÓN'!$CA$4:CB451,2,0),0)","v":0},null,null,null,null,null,null,null,null,null,null,null,null,null,{"$f":"SUM(F296:Q296)","v":0},{"$f":"COUNT(F296:Q296)","v":0},{"$f":"IFERROR(VLOOKUP(B303,'[1]FACTORES DE EMISIÓN'!$CA$4:$CG$37,5,0),0)","v":0},{"$f":"IFERROR(VLOOKUP(B303,'[1]FACTORES DE EMISIÓN'!$CA$4:$CG$37,6,0),0)","v":0},{"$f":"IFERROR((R296*T296)/1000,0)","v":0}]
[null,null,null,null,null,null,null,null,null,null,null,null,null,null,null,null,null,null,null,null,null,{"$f":"SUM(V292:V296)","v":0}]
[null,"Escoja la opción que corresponda"]
[null,null,null,"UNIDAD EN LA CUAL DEBE INGRESAR LA INFORMACIÓN",null,"CONSUMO DE ACUERDO A LA UNIDAD SOICITADA",null,null,null,null,null,null,null,null,null,null,null,null,"No. DE DATOS","FACTOR DE EMISIÓN ","UNIDADES DEL FACTOR","HUELLA DE CARBONO \n(TON CO2)"]
[null,null,null,null,null,"ENE","FEB","MAR","ABR","MAY","JUN","JUL","AGO","SEP","OCT","NOV","DIC","TOTAL"]
[null,null,null,null,null,"Digite el valor de la unidad asociada a la fuente de emisión elegida"]
[null,null,null,{"$f":"IFERROR(VLOOKUP(B309,'[1]FACTORES DE EMISIÓN'!$CA$4:CB457,2,0),0)","v":0},null,null,null,null,null,null,null,null,null,null,null,null,null,{"$f":"SUM(F302:Q302)","v":0},{"$f":"COUNT(F302:Q302)","v":0},{"$f":"IFERROR(VLOOKUP(B309,'[1]FACTORES DE EMISIÓN'!$CA$4:$CG$37,5,0),0)","v":0},{"$f":"IFERROR(VLOOKUP(B309,'[1]FACTORES DE EMISIÓN'!$CA$4:$CG$37,6,0),0)","v":0},{"$f":"IFERROR((R302*T302)/1000,0)","v":0}]
[null,null,null,{"$f":"IFERROR(VLOOKUP(B310,'[1]FACTORES DE EMISIÓN'!$CA$4:CB458,2,0),0)","v":0},null,null,null,null,null,null,null,null,null,null,null,null,null,{"$f":"SUM(F303:Q303)","v":0},{"$f":"COUNT(F303:Q303)","v":0},{"$f":"IFERROR(VLOOKUP(B310,'[1]FACTORES DE EMISIÓN'!$CA$4:$CG$37,5,0),0)","v":0},{"$f":"IFERROR(VLOOKUP(B310,'[1]FACTORES DE EMISIÓN'!$CA$4:$CG$37,6,0),0)","v":0},{"$f":"IFERROR((R303*T303)/1000,0)","v":0}]
[null,"TOTAL EMISIONES",null,{"$f":"IFERROR(VLOOKUP(B311,'[1]FACTORES DE EMISIÓN'!$CA$4:CB459,2,0),0)","v":0},null,null,null,null,null,null,null,null,null,null,null,null,null,{"$f":"SUM(F304:Q304)","v":0},{"$f":"COUNT(F304:Q304)","v":0},{"$f":"IFERROR(VLOOKUP(B311,'[1]FACTORES DE EMISIÓN'!$CA$4:$CG$37,5,0),0)","v":0},{"$f":"IFERROR(VLOOKUP(B311,'[1]FACTORES DE EMISIÓN'!$CA$4:$CG$37,6,0),0)","v":0},{"$f":"IFERROR((R304*T304)/1000,0)","v":0}]
[null,null,null,{"$f":"IFERROR(VLOOKUP(B312,'[1]FACTORES DE EMISIÓN'!$CA$4:CB460,2,0),0)","v":0},null,null,null,null,null,null,null,null,",",null,null,null,null,{"$f":"SUM(F305:Q305)","v":0},{"$f":"COUNT(F305:Q305)","v":0},{"$f":"IFERROR(VLOOKUP(B312,'[1]FACTORES DE EMISIÓN'!$CA$4:$CG$37,5,0),0)","v":0},{"$f":"IFERROR(VLOOKUP(B312,'[1]FACTORES DE EMISIÓN'!$CA$4:$CG$37,6,0),0)","v":0},{"$f":"IFERROR((R305*T305)/1000,0)","v":0}]
[null,"FUENTE DE EMISIÓN",null,{"$f":"IFERROR(VLOOKUP(B313,'[1]FACTORES DE EMISIÓN'!$CA$4:CB461,2,0),0)","v":0},null,null,null,null,null,null,null,null,null,null,null,null,null,{"$f":"SUM(F306:Q306)","v":0},{"$f":"COUNT(F306:Q306)","v":0},{"$f":"IFERROR(VLOOKUP(B313,'[1]FACTORES DE EMISIÓN'!$CA$4:$CG$37,5,0),0)","v":0},{"$f":"IFERROR(VLOOKUP(B313,'[1]FACTORES DE EMISIÓN'!$CA$4:$CG$37,6,0),0)","v":0},{"$f":"IFERROR((R306*T306)/1000,0)","v":0}]
[null,null,null,null,null,null,null,null,null,null,null,null,null,null,null,null,null,null,null,null,null,{"$f":"SUM(V302:V306)","v":0}]
[null,"Escoja la opción que corresponda"]
[null,null,null,"UNIDAD EN LA CUAL DEBE INGRESAR LA INFORMACIÓN",null,"CONSUMO DE ACUERDO A LA UNIDAD SOICITADA",null,null,null,null,null,null,null,null,null,null,null,null,"No. DE DATOS","FACTOR DE EMISIÓN ","UNIDADES DEL FACTOR","HUELLA DE CARBONO \n(TON CO2)"]
[null,null,null,null,null,"ENE","FEB","MAR","ABR","MAY","JUN","JUL","AGO","SEP","OCT","NOV","DIC","TOTAL"]
[null,null,null,null,null,"Digite el valor de la unidad asociada a la fuente de emisión elegida"]
[null,null,null,{"$f":"IFERROR(VLOOKUP(B319,'[1]FACTORES DE EMISIÓN'!$CA$4:CB467,2,0),0)","v":0},null,null,null,null,null,null,null,null,null,null,null,null,null,{"$f":"SUM(F312:Q312)","v":0},{"$f":"COUNT(F312:Q312)","v":0},{"$f":"IFERROR(VLOOKUP(B319,'[1]FACTORES DE EMISIÓN'!$CA$4:$CG$37,5,0),0)","v":0},{"$f":"IFERROR(VLOOKUP(B319,'[1]FACTORES DE EMISIÓN'!$CA$4:$CG$37,6,0),0)","v":0},{"$f":"IFERROR((R312*T312)/1000,0)","v":0}]
[null,null,null,{"$f":"IFERROR(VLOOKUP(B320,'[1]FACTORES DE EMISIÓN'!$CA$4:CB468,2,0),0)","v":0},null,null,null,null,null,null,null,null,null,null,null,null,null,{"$f":"SUM(F313:Q313)","v":0},{"$f":"COUNT(F313:Q313)","v":0},{"$f":"IFERROR(VLOOKUP(B320,'[1]FACTORES DE EMISIÓN'!$CA$4:$CG$37,5,0),0)","v":0},{"$f":"IFERROR(VLOOKUP(B320,'[1]FACTORES DE EMISIÓN'!$CA$4:$CG$37,6,0),0)","v":0},{"$f":"IFERROR((R313*T313)/1000,0)","v":0}]
[null,"TOTAL EMISIONES",null,{"$f":"IFERROR(VLOOKUP(B321,'[1]FACTORES DE EMISIÓN'!$CA$4:CB469,2,0),0)","v":0},null,null,null,null,null,null,null,null,null,null,null,null,null,{"$f":"SUM(F314:Q314)","v":0},{"$f":"COUNT(F314:Q314)","v":0},{"$f":"IFERROR(VLOOKUP(B321,'[1]FACTORES DE EMISIÓN'!$CA$4:$CG$37,5,0),0)","v":0},{"$f":"IFERROR(VLOOKUP(B321,'[1]FACTORES DE EMISIÓN'!$CA$4:$CG$37,6,0),0)","v":0},{"$f":"IFERROR((R314*T314)/1000,0)","v":0}]
[null,null,null,{"$f":"IFERROR(VLOOKUP(B322,'[1]FACTORES DE EMISIÓN'!$CA$4:CB470,2,0),0)","v":0},null,null,null,null,null,null,null,null,",",null,null,null,null,{"$f":"SUM(F315:Q315)","v":0},{"$f":"COUNT(F315:Q315)","v":0},{"$f":"IFERROR(VLOOKUP(B322,'[1]FACTORES DE EMISIÓN'!$CA$4:$CG$37,5,0),0)","v":0},{"$f":"IFERROR(VLOOKUP(B322,'[1]FACTORES DE EMISIÓN'!$CA$4:$CG$37,6,0),0)","v":0},{"$f":"IFERROR((R315*T315)/1000,0)","v":0}]
[null,"FUENTE DE EMISIÓN",null,{"$f":"IFERROR(VLOOKUP(B323,'[1]FACTORES DE EMISIÓN'!$CA$4:CB471,2,0),0)","v":0},null,null,null,null,null,null,null,null,null,null,null,null,null,{"$f":"SUM(F316:Q316)","v":0},{"$f":"COUNT(F316:Q316)","v":0},{"$f":"IFERROR(VLOOKUP(B323,'[1]FACTORES DE EMISIÓN'!$CA$4:$CG$37,5,0),0)","v":0},{"$f":"IFERROR(VLOOKUP(B323,'[1]FACTORES DE EMISIÓN'!$CA$4:$CG$37,6,0),0)","v":0},{"$f":"IFERROR((R316*T316)/1000,0)","v":0}]
[null,null,null,null,null,null,null,null,null,null,null,null,null,null,null,null,null,null,null,null,null,{"$f":"SUM(V312:V316)","v":0}]
[null,"Escoja la opción que corresponda"]
[null,null,null,"UNIDAD EN LA CUAL DEBE INGRESAR LA INFORMACIÓN",null,"CONSUMO DE ACUERDO A LA UNIDAD SOICITADA",null,null,null,null,null,null,null,null,null,null,null,null,"No. DE DATOS","FACTOR DE EMISIÓN ","UNIDADES DEL FACTOR","HUELLA DE CARBONO \n(TON CO2)"]
[null,null,null,null,null,"ENE","FEB","MAR","ABR","MAY","JUN","JUL","AGO","SEP","OCT","NOV","DIC","TOTAL"]
[null,null,null,null,null,"Digite el valor de la unidad asociada a la fuente de emisión elegida"]
[null,null,null,{"$f":"IFERROR(VLOOKUP(B329,'[1]FACTORES DE EMISIÓN'!$CA$4:CB477,2,0),0)","v":0},null,null,null,null,null,null,null,null,null,null,null,null,null,{"$f":"SUM(F322:Q322)","v":0},{"$f":"COUNT(F322:Q322)","v":0},{"$f":"IFERROR(VLOOKUP(B329,'[1]FACTORES DE EMISIÓN'!$CA$4:$CG$37,5,0),0)","v":0},{"$f":"IFERROR(VLOOKUP(B329,'[1]FACTORES DE EMISIÓN'!$CA$4:$CG$37,6,0),0)","v":0},{"$f":"IFERROR((R322*T322)/1000,0)","v":0}]
[null,null,null,{"$f":"IFERROR(VLOOKUP(B330,'[1]FACTORES DE EMISIÓN'!$CA$4:CB478,2,0),0)","v":0},null,null,null,null,null,null,null,null,null,null,null,null,null,{"$f":"SUM(F323:Q323)","v":0},{"$f":"COUNT(F323:Q323)","v":0},{"$f":"IFERROR(VLOOKUP(B330,'[1]FACTORES DE EMISIÓN'!$CA$4:$CG$37,5,0),0)","v":0},{"$f":"IFERROR(VLOOKUP(B330,'[1]FACTORES DE EMISIÓN'!$CA$4:$CG$37,6,0),0)","v":0},{"$f":"IFERROR((R323*T323)/1000,0)","v":0}]
[null,"TOTAL EMISIONES",null,{"$f":"IFERROR(VLOOKUP(B331,'[1]FACTORES DE EMISIÓN'!$CA$4:CB479,2,0),0)","v":0},null,null,null,null,null,null,null,null,null,null,null,null,null,{"$f":"SUM(F324:Q324)","v":0},{"$f":"COUNT(F324:Q324)","v":0},{"$f":"IFERROR(VLOOKUP(B331,'[1]FACTORES DE EMISIÓN'!$CA$4:$CG$37,5,0),0)","v":0},{"$f":"IFERROR(VLOOKUP(B331,'[1]FACTORES DE EMISIÓN'!$CA$4:$CG$37,6,0),0)","v":0},{"$f":"IFERROR((R324*T324)/1000,0)","v":0}]
[null,null,null,{"$f":"IFERROR(VLOOKUP(B332,'[1]FACTORES DE EMISIÓN'!$CA$4:CB480,2,0),0)","v":0},null,null,null,null,null,null,null,null,",",null,null,null,null,{"$f":"SUM(F325:Q325)","v":0},{"$f":"COUNT(F325:Q325)","v":0},{"$f":"IFERROR(VLOOKUP(B332,'[1]FACTORES DE EMISIÓN'!$CA$4:$CG$37,5,0),0)","v":0},{"$f":"IFERROR(VLOOKUP(B332,'[1]FACTORES DE EMISIÓN'!$CA$4:$CG$37,6,0),0)","v":0},{"$f":"IFERROR((R325*T325)/1000,0)","v":0}]
[null,"FUENTE DE EMISIÓN",null,{"$f":"IFERROR(VLOOKUP(B333,'[1]FACTORES DE EMISIÓN'!$CA$4:CB481,2,0),0)","v":0},null,null,null,null,null,null,null,null,null,null,null,null,null,{"$f":"SUM(F326:Q326)","v":0},{"$f":"COUNT(F326:Q326)","v":0},{"$f":"IFERROR(VLOOKUP(B333,'[1]FACTORES DE EMISIÓN'!$CA$4:$CG$37,5,0),0)","v":0},{"$f":"IFERROR(VLOOKUP(B333,'[1]FACTORES DE EMISIÓN'!$CA$4:$CG$37,6,0),0)","v":0},{"$f":"IFERROR((R326*T326)/1000,0)","v":0}]
[null,null,null,null,null,null,null,null,null,null,null,null,null,null,null,null,null,null,null,null,null,{"$f":"SUM(V322:V326)","v":0}]
[null,"Escoja la opción que corresponda"]
[]
[]
[]
[]
[]
[null,"TOTAL EMISIONES"]

{"sheet":"EVS","index":4,"n_rows":1553,"n_cols":28,"rows_kept":1553,"cut":false,"hidden":true,"merged":[]}
["AÑO ","¿Organización en la que trabaja?","Nombre completo","Dirección de correo electrónico a la cual remitiremos su resultado:","Localidad ","¿Usa calentador en su baño?","¿Minutos de su baño diario?","¿Horas  de su baño diario?","Huella de cabono  (Kg CO2/mes)","¿Tipo de bombillos en el hogar?"," # Ahorradores ","#LED","# Incandescentes ","T. solar","Huella de cabono  (Kg CO2/mes)","Promedio bolsas de residuos generadas  a la semana","Huella de cabono  (Kg CO2/mes)","¿Cuál modo de transporte utiliza con mayor frecuencia para ir al trabajo o universidad?","Distancia recorrida  (km/mes )","Huella de cabono  (Kg CO2/mes)","¿Con qué frecuencia consume carne de res a la semana?","Huella de cabono  (Kg CO2/mes)","¿Cuantos restos de comida dejo  en el plato ?","Huella de cabono  (Kg CO2/mes)","TOTAL HUELLA DE CARBONO(Kg CO2/mes) ","TOTAL HUELLA DE CARBONO(Ton CO2/mes) ","TOTAL HUELLA DE CARBONO(Kg CO2/año) ","TOTAL HUELLA DE CARBONO(Ton CO2/año) "]
[2016,"VERITEST LTDA","jtrjt","dsfdsf@dfsf.com","Ciudad Bolívar","Calentador a Gas",20,{"$f":"+G2/60","v":0.33333333333333331},{"$f":"IF(F2=\"Calentador a Gas\",(H2*1.6*1.98*30),IF(F2=\"Calentador Eléctrico\",(H2*1.3*0.199*30),IF(F2=\"Ducha Eléctrica\",(H2*4*0.199*30),IF(F2=\"Ninguno\",\"0\"))))","v":31.68},"Tecnología solar ",8,8,8,8,{"$f":"IF(J2=\"Ahorradores \",(K2*0.02*5*0.199*30),IF(J2=\"Incandescentes \",(M2*0.1*5*0.199*30),IF(J2=\"LED\",(L2*0.007*5*0.199*30),IF(J2=\"Tecnología solar \",(N2*0)))))","v":0},1.5,{"$f":"P2*9*0.8312","v":11.221200000000001},"En bicicleta",600,{"$f":"IF(R2=\"En bicicleta\",(0*S2),IF(R2=\"En carro\",(0.218 *S2),IF(R2=\"En bus o SITP \",((0.78703*S2)/40),IF(R2=\" En transmilenio\",((0.68516*S2)/140)))))","v":0},"5 veces por semana",{"$f":"IF(U2=\"Nunca\",0,IF(U2=\"3 veces por semana\",\"513\",IF(U2=\"5 veces por semana\",855,IF(U2=\"Todos los días\",1197))))","v":855},"No dejo restos de alimentos",{"$f":"IF(W2=\"No dejo restos de alimentos\",(0),IF(W2=\"Un cuarto del plato\",(0.25*0.5*0.8312*30),IF(W2=\"La mitad del plato\",(0.5*0.5*0.8312*30),IF(W2=\"Tres cuartos del plato\",(0.75*0.5*0.8312*30)))))","v":0},{"$f":"V2+T2+Q2+O2+I2+X2","v":897.9011999999999},{"$f":"Y2/1000","v":0.89790119999999995},{"$f":"Y2*12","v":10774.814399999999},{"$f":"Z2*12","v":10.7748144}]
[2016,"GASEOSAS COLOMBIANAS S.A.S PLANTA CENTRO","Alejandra Molano","sip@hotmail.com.co","Puente Aranda","Calentador Eléctrico",20,{"$f":"+G3/60","v":0.33333333333333331},{"$f":"IF(F3=\"Calentador a Gas\",(H3*1.6*1.98*30),IF(F3=\"Calentador Eléctrico\",(H3*1.3*0.199*30),IF(F3=\"Ducha Eléctrica\",(H3*4*0.199*30),IF(F3=\"Ninguno\",\"0\"))))","v":2.5870000000000002},"Incandescentes ",8,8,10,8,{"$f":"IF(J3=\"Ahorradores \",(K3*0.02*5*0.199*30),IF(J3=\"Incandescentes \",(M3*0.1*5*0.199*30),IF(J3=\"LED\",(L3*0.007*5*0.199*30),IF(J3=\"Tecnología solar \",(N3*0)))))","v":29.85},5,{"$f":"P3*9*0.8312","v":37.404000000000003}," En transmilenio",600,{"$f":"IF(R3=\"En bicicleta\",(0*S3),IF(R3=\"En carro\",(0.218 *S3),IF(R3=\"En bus o SITP \",((0.78703*S3)/40),IF(R3=\" En transmilenio\",((0.68516*S3)/140)))))","v":2.9363999999999999},"3 veces por semana","513","Un cuarto del plato",3.117,{"$f":"V3+T3+Q3+O3+I3+X3","v":588.89440000000002},{"$f":"Y3/1000","v":0.58889440000000004},{"$f":"Y3*12","v":7066.7327999999998},{"$f":"Z3*12","v":7.0667328000000005}]
[2016,"AGENCIA DE ADUANAS SIACO S.A.S. NIVEL 1","David Ramirez","dramirez180929@gmail.com","Suba","Ducha Eléctrica",20,0.33333333333333331,7.9599999999999991,"LED",8,16,8,8,3.3432000000000004,5,37.404000000000003,"En bus o SITP ",600,11.80545,"Nunca",0,"La mitad del plato",{"$f":"IF(W4=\"No dejo restos de alimentos\",(0),IF(W4=\"Un cuarto del plato\",(0.25*0.5*0.8312*30),IF(W4=\"La mitad del plato\",(0.5*0.5*0.8312*30),IF(W4=\"Tres cuartos del plato\",(0.75*0.5*0.8312*30)))))","v":6.234},66.746650000000002,6.6746650000000005E-2,800.95980000000009,0.8009598]
[2016,"AGENCIA DE ADUANAS SIACO S.A.S. NIVEL 1","Jaime Andres Castañeda Moyano","jaime.castaneda@repremundo.com","Engativá","Ninguno",5,8.3333333333333329E-2,"0","Ahorradores ",8,8,8,8,4.7759999999999998,5,37.404000000000003,"En carro",600,130.80000000000001,"Todos los días",1197,"Tres cuartos del plato",{"$f":"IF(W5=\"No dejo restos de alimentos\",(0),IF(W5=\"Un cuarto del plato\",(0.25*0.5*0.8312*30),IF(W5=\"La mitad del plato\",(0.5*0.5*0.8312*30),IF(W5=\"Tres cuartos del plato\",(0.75*0.5*0.8312*30)))))","v":9.3510000000000009},1379.3310000000001,1.3793310000000001,16551.972000000002,16.551971999999999]
[2016,"ANÁLISIS FISICOQUÍMICO Y MICROBIOLÓGICO AQM S.A.S.","Eliana Fernández","eliana_0925@hotmail.com","Fontibón","Calentador a Gas",10,0.16666666666666666,15.84,"Tecnología solar ",8,8,8,8,0,5,37.404000000000003," En transmilenio",600,2.9363999999999999,"Nunca",0,"La mitad del plato",6.234,62.414400000000008,6.2414400000000009E-2,748.97280000000012,0.74897280000000011]
[2016,"DIRECCIÓN DE PROTECCIÓN Y SERVICIOS ESPECIALES","Eliud Castro Martínez","dipro.gambiental@policia.gov.co","Engativá","Calentador a Gas",5,8.3333333333333329E-2,7.92,"Tecnología solar ",8,8,8,8,0,5,37.404000000000003," En transmilenio",600,2.9363999999999999,"Nunca",0,"No dejo restos de alimentos",0,48.260400000000004,4.8260400000000002E-2,579.12480000000005,0.5791248]
[2016,"TECSER LABORATORIOS S.A.","LEIDY JOHANA RICARDO","aseguramiento@pyvascosmetic.com","Engativá","Calentador a Gas",10,0.16666666666666666,15.84,"Tecnología solar ",8,8,8,8,0,5,37.404000000000003," En transmilenio",600,2.9363999999999999,"Nunca",0,"Un cuarto del plato",3.117,59.297400000000003,5.92974E-2,711.56880000000001,0.7115688]
[2016,"GNE SOLUCIONES S.A.S. / EDS BIOMAX PUENTE AEREO/ Y BOSA","ZULMA PATRICIA ROJAS MARTINEZ","edsesperanza@biomax.com","Usme","Calentador a Gas",10,0.16666666666666666,15.84,"Tecnología solar ",8,8,8,8,0,5,37.404000000000003," En transmilenio",600,2.9363999999999999,"Nunca",0,"Un cuarto del plato",3.117,59.297400000000003,5.92974E-2,711.56880000000001,0.7115688]
[2016,"GNE SOLUCIONES S.A.S. / EDS BIOMAX PUENTE AEREO/ Y BOSA","Alvaro Rueda Rueda ","edsesperanza@biomax.co","Soacha ","Calentador a Gas",10,0.16666666666666666,15.84,"Tecnología solar ",8,8,8,8,0,5,37.404000000000003," En transmilenio",600,2.9363999999999999,"Nunca",0,"La mitad del plato",6.234,62.414400000000008,6.2414400000000009E-2,748.97280000000012,0.74897280000000011]
[2016,"C.I SIGRA S.A","Maria Fernanda","mafe.ricau14@gmail.com","Suba","Calentador a Gas",8,0.13333333333333333,12.672000000000001,"Tecnología solar ",8,8,8,8,0,5,37.404000000000003," En transmilenio",600,2.9363999999999999,"Nunca",0,"No dejo restos de alimentos",0,53.0124,5.3012400000000001E-2,636.14879999999994,0.63614879999999996]
[2016,"TECSER LABORATORIOS S.A.","Daniel Alberto González Cano","desarrollo@pyvascosmetic.com","Antonio Nariño","Calentador a Gas",5,8.3333333333333329E-2,7.92,"Tecnología solar ",8,8,8,8,0,5,37.404000000000003," En transmilenio",600,2.9363999999999999,"Nunca",0,"No dejo restos de alimentos",0,48.260400000000004,4.8260400000000002E-2,579.12480000000005,0.5791248]
[2016,"TECSER LABORATORIOS S.A.","Laura Camila Castro Celis ","saludocupacional@pyvascosmetic.com","Usme","Calentador a Gas",5,8.3333333333333329E-2,7.92,"Tecnología solar ",8,8,8,8,0,5,37.404000000000003," En transmilenio",600,2.9363999999999999,"Nunca",0,"No dejo restos de alimentos",0,48.260400000000004,4.8260400000000002E-2,579.12480000000005,0.5791248]
[2016,"ASEPSIS PRODUCTS DE COLOMBIA- PROASEPSIS S.A.S","RUTH AMELIA CALDERON HEREDIA ","rcalderon@proasepsis.com","San Cristóbal","Calentador a Gas",15,0.25,23.76,"Tecnología solar ",8,8,8,8,0,5,37.404000000000003," En transmilenio",600,2.9363999999999999,"Nunca",0,"No dejo restos de alimentos",0,64.100400000000008,6.4100400000000002E-2,769.20480000000009,0.76920480000000002]
[2016,"ASEPSIS PRODUCTS DE COLOMBIA- PROASEPSIS S.A.S","Eugenio Huertas","j.eugenio335@hotmail.com","San Cristóbal","Calentador a Gas",6.5,0.10833333333333334,10.295999999999999,"Tecnología solar ",8,8,8,8,0,5,37.404000000000003," En transmilenio",600,2.9363999999999999,"Nunca",0,"No dejo restos de alimentos",0,50.636400000000002,5.0636400000000005E-2,607.63679999999999,0.60763680000000009]
[2016,"GNE SOLUCIONES S.A.S. / EDS BIOMAX PUENTE AEREO/ Y BOSA","WILLIAM AYCARDO POVEDA ROJAS","EDSESPERANZA@BIOMAX.CO","Soacha ","Calentador a Gas",15,0.25,23.76,"Tecnología solar ",8,8,8,8,0,5,37.404000000000003," En transmilenio",600,2.9363999999999999,"Nunca",0,"No dejo restos de alimentos",0,64.100400000000008,6.4100400000000002E-2,769.20480000000009,0.76920480000000002]
[2016,"GNE SOLUCIONES S.A.S. / EDS BIOMAX PUENTE AEREO/ Y BOSA","leydy tatiana aroca novoa","edsesperanza@biomas.co","Soacha ","Calentador a Gas",15,0.25,23.76,"Tecnología solar ",8,8,8,8,0,5,37.404000000000003," En transmilenio",600,2.9363999999999999,"Nunca",0,"No dejo restos de alimentos",0,64.100400000000008,6.4100400000000002E-2,769.20480000000009,0.76920480000000002]
[2016,"GNE SOLUCIONES S.A.S. / EDS BIOMAX PUENTE AEREO/ Y BOSA","ARBEYS QUIROGA DUSSAN ","EDSESPERANZA@BIOMAX.CO","Ciudad Bolívar","Calentador a Gas",15,0.25,23.76,"Tecnología solar ",8,8,8,8,0,5,37.404000000000003," En transmilenio",600,2.9363999999999999,"Nunca",0,"No dejo restos de alimentos",0,64.100400000000008,6.4100400000000002E-2,769.20480000000009,0.76920480000000002]
[2016,"ASEPSIS PRODUCTS DE COLOMBIA- PROASEPSIS S.A.S","INGRID ARJONA","iarjona@gmail.com","Fontibón","Calentador a Gas",8,0.13333333333333333,12.672000000000001,"Tecnología solar ",8,8,8,8,0,5,37.404000000000003," En transmilenio",600,2.9363999999999999,"Nunca",0,"No dejo restos de alimentos",0,53.0124,5.3012400000000001E-2,636.14879999999994,0.63614879999999996]
[2016,"GNE SOLUCIONES S.A.S. / EDS BIOMAX PUENTE AEREO/ Y BOSA","mireya garcia torres","edsesperanza@biomax.co","Bosa","Calentador a Gas",15,0.25,23.76,"Tecnología solar ",8,8,8,8,0,5,37.404000000000003," En transmilenio",600,2.9363999999999999,"Nunca",0,"No dejo restos de alimentos",0,64.100400000000008,6.4100400000000002E-2,769.20480000000009,0.76920480000000002]
[2016,"GNE SOLUCIONES S.A.S. / EDS BIOMAX PUENTE AEREO/ Y BOSA","OSMAN CARLOS ALVAREZ GARCIA","EDSESPERANZA@BIOMAX.CO","Soacha ","Calentador a Gas",10,0.16666666666666666,15.84,"Tecnología solar ",8,8,8,8,0,5,37.404000000000003," En transmilenio",600,2.9363999999999999,"Nunca",0,"No dejo restos de alimentos",0,56.180400000000006,5.6180400000000005E-2,674.16480000000001,0.67416480000000001]
[null,null,null,null,null,"Calentador a Gas",null,null,0,"Tecnología solar ",null,null,null,null,0,null,0," En transmilenio",null,0,"Nunca",0,"No dejo restos de alimentos",0,0,0,0,0]
[null,null,null,null,null,"Calentador a Gas",null,null,0,"Tecnología solar ",null,null,null,null,0,null,0," En transmilenio",null,0,"Nunca",0,"No dejo restos de alimentos",0,0,0,0,0]
[null,null,null,null,null,"Calentador a Gas",null,null,0,"Tecnología solar ",null,null,null,null,0,null,0," En transmilenio",null,0,"Nunca",0,"No dejo restos de alimentos",0,0,0,0,0]
[null,null,null,null,null,"Calentador a Gas",null,null,0,"Tecnología solar ",null,null,null,null,0,null,0," En transmilenio",null,0,"Nunca",0,"No dejo restos de alimentos",0,0,0,0,0]
[null,null,null,null,null,"Calentador a Gas",null,null,0,"Tecnología solar ",null,null,null,null,0,null,0," En transmilenio",null,0,"Nunca",0,"No dejo restos de alimentos",0,0,0,0,0]
[null,null,null,null,null,"Calentador a Gas",null,null,0,"Tecnología solar ",null,null,null,null,0,null,0," En transmilenio",null,0,"Nunca",0,"No dejo restos de alimentos",0,0,0,0,0]
[null,null,null,null,null,"Calentador a Gas",null,null,0,"Tecnología solar ",null,null,null,null,0,null,0," En transmilenio",null,0,"Nunca",0,"No dejo restos de alimentos",0,0,0,0,0]
[null,null,null,null,null,"Calentador a Gas",null,null,0,"Tecnología solar ",null,null,null,null,0,null,0," En transmilenio",null,0,"Nunca",0,"No dejo restos de alimentos",0,0,0,0,0]
[null,null,null,null,null,"Calentador a Gas",null,null,0,"Tecnología solar ",null,null,null,null,0,null,0," En transmilenio",null,0,"Nunca",0,"No dejo restos de alimentos",0,0,0,0,0]
[null,null,null,null,null,"Calentador a Gas",null,null,0,"Tecnología solar ",null,null,null,null,0,null,0," En transmilenio",null,0,"Nunca",0,"No dejo restos de alimentos",0,0,0,0,0]
[null,null,null,null,null,"Calentador a Gas",null,null,0,"Tecnología solar ",null,null,null,null,0,null,0," En transmilenio",null,0,"Nunca",0,"No dejo restos de alimentos",0,0,0,0,0]
[null,null,null,null,null,"Calentador a Gas",null,null,0,"Tecnología solar ",null,null,null,null,0,null,0," En transmilenio",null,0,"Nunca",0,"No dejo restos de alimentos",0,0,0,0,0]
[null,null,null,null,null,"Calentador a Gas",null,null,0,"Tecnología solar ",null,null,null,null,0,null,0," En transmilenio",null,0,"Nunca",0,"No dejo restos de alimentos",0,0,0,0,0]
[null,null,null,null,null,"Calentador a Gas",null,null,0,"Tecnología solar ",null,null,null,null,0,null,0," En transmilenio",null,0,"Nunca",0,"No dejo restos de alimentos",0,0,0,0,0]
[null,null,null,null,null,"Calentador a Gas",null,null,0,"Tecnología solar ",null,null,null,null,0,null,0," En transmilenio",null,0,"Nunca",0,"No dejo restos de alimentos",0,0,0,0,0]
[null,null,null,null,null,"Calentador a Gas",null,null,0,"Tecnología solar ",null,null,null,null,0,null,0," En transmilenio",null,0,"Nunca",0,"No dejo restos de alimentos",0,0,0,0,0]
[null,null,null,null,null,"Calentador a Gas",null,null,0,"Tecnología solar ",null,null,null,null,0,null,0," En transmilenio",null,0,"Nunca",0,"No dejo restos de alimentos",0,0,0,0,0]
[null,null,null,null,null,"Calentador a Gas",null,null,0,"Tecnología solar ",null,null,null,null,0,null,0," En transmilenio",null,0,"Nunca",0,"No dejo restos de alimentos",0,0,0,0,0]
[null,null,null,null,null,"Calentador a Gas",null,null,0,"Tecnología solar ",null,null,null,null,0,null,0," En transmilenio",null,0,"Nunca",0,"No dejo restos de alimentos",0,0,0,0,0]
[null,null,null,null,null,"Calentador a Gas",null,null,0,"Tecnología solar ",null,null,null,null,0,null,0," En transmilenio",null,0,"Nunca",0,"No dejo restos de alimentos",0,0,0,0,0]
[null,null,null,null,null,"Calentador a Gas",null,null,0,"Tecnología solar ",null,null,null,null,0,null,0," En transmilenio",null,0,"Nunca",0,"No dejo restos de alimentos",0,0,0,0,0]
[null,null,null,null,null,"Calentador a Gas",null,null,0,"Tecnología solar ",null,null,null,null,0,null,0," En transmilenio",null,0,"Nunca",0,"No dejo restos de alimentos",0,0,0,0,0]
[null,null,null,null,null,"Calentador a Gas",null,null,0,"Tecnología solar ",null,null,null,null,0,null,0," En transmilenio",null,0,"Nunca",0,"No dejo restos de alimentos",0,0,0,0,0]
[null,null,null,null,null,"Calentador a Gas",null,null,0,"Tecnología solar ",null,null,null,null,0,null,0," En transmilenio",null,0,"Nunca",0,"No dejo restos de alimentos",0,0,0,0,0]
[null,null,null,null,null,"Calentador a Gas",null,null,0,"Tecnología solar ",null,null,null,null,0,null,0," En transmilenio",null,0,"Nunca",0,"No dejo restos de alimentos",0,0,0,0,0]
[null,null,null,null,null,"Calentador a Gas",null,null,0,"Tecnología solar ",null,null,null,null,0,null,0," En transmilenio",null,0,"Nunca",0,"No dejo restos de alimentos",0,0,0,0,0]
[null,null,null,null,null,"Calentador a Gas",null,null,0,"Tecnología solar ",null,null,null,null,0,null,0," En transmilenio",null,0,"Nunca",0,"No dejo restos de alimentos",0,0,0,0,0]
[null,null,null,null,null,"Calentador a Gas",null,null,0,"Tecnología solar ",null,null,null,null,0,null,0," En transmilenio",null,0,"Nunca",0,"No dejo restos de alimentos",0,0,0,0,0]
[null,null,null,null,null,"Calentador a Gas",null,null,0,"Tecnología solar ",null,null,null,null,0,null,0," En transmilenio",null,0,"Nunca",0,"No dejo restos de alimentos",0,0,0,0,0]
[null,null,null,null,null,"Calentador a Gas",null,null,0,"Tecnología solar ",null,null,null,null,0,null,0," En transmilenio",null,0,"Nunca",0,"No dejo restos de alimentos",0,0,0,0,0]
[null,null,null,null,null,"Calentador a Gas",null,null,0,"Tecnología solar ",null,null,null,null,0,null,0," En transmilenio",null,0,"Nunca",0,"No dejo restos de alimentos",0,0,0,0,0]
[null,null,null,null,null,"Calentador a Gas",null,null,0,"Tecnología solar ",null,null,null,null,0,null,0," En transmilenio",null,0,"Nunca",0,"No dejo restos de alimentos",0,0,0,0,0]
[null,null,null,null,null,"Calentador a Gas",null,null,0,"Tecnología solar ",null,null,null,null,0,null,0," En transmilenio",null,0,"Nunca",0,"No dejo restos de alimentos",0,0,0,0,0]
[null,null,null,null,null,"Calentador a Gas",null,null,0,"Tecnología solar ",null,null,null,null,0,null,0," En transmilenio",null,0,"Nunca",0,"No dejo restos de alimentos",0,0,0,0,0]
[null,null,null,null,null,"Calentador a Gas",null,null,0,"Tecnología solar ",null,null,null,null,0,null,0," En transmilenio",null,0,"Nunca",0,"No dejo restos de alimentos",0,0,0,0,0]
[null,null,null,null,null,"Calentador a Gas",null,null,0,"Tecnología solar ",null,null,null,null,0,null,0," En transmilenio",null,0,"Nunca",0,"No dejo restos de alimentos",0,0,0,0,0]
[null,null,null,null,null,"Calentador a Gas",null,null,0,"Tecnología solar ",null,null,null,null,0,null,0," En transmilenio",null,0,"Nunca",0,"No dejo restos de alimentos",0,0,0,0,0]
[null,null,null,null,null,"Calentador a Gas",null,null,0,"Tecnología solar ",null,null,null,null,0,null,0," En transmilenio",null,0,"Nunca",0,"No dejo restos de alimentos",0,0,0,0,0]
[null,null,null,null,null,"Calentador a Gas",null,null,0,"Tecnología solar ",null,null,null,null,0,null,0," En transmilenio",null,0,"Nunca",0,"No dejo restos de alimentos",0,0,0,0,0]
[null,null,null,null,null,"Calentador a Gas",null,null,0,"Tecnología solar ",null,null,null,null,0,null,0," En transmilenio",null,0,"Nunca",0,"No dejo restos de alimentos",0,0,0,0,0]
[null,null,null,null,null,"Calentador a Gas",null,null,0,"Tecnología solar ",null,null,null,null,0,null,0," En transmilenio",null,0,"Nunca",0,"No dejo restos de alimentos",0,0,0,0,0]
[null,null,null,null,null,"Calentador a Gas",null,null,0,"Tecnología solar ",null,null,null,null,0,null,0," En transmilenio",null,0,"Nunca",0,"No dejo restos de alimentos",0,0,0,0,0]
[null,null,null,null,null,"Calentador a Gas",null,null,0,"Tecnología solar ",null,null,null,null,0,null,0," En transmilenio",null,0,"Nunca",0,"No dejo restos de alimentos",0,0,0,0,0]
[null,null,null,null,null,"Calentador a Gas",null,null,0,"Tecnología solar ",null,null,null,null,0,null,0," En transmilenio",null,0,"Nunca",0,"No dejo restos de alimentos",0,0,0,0,0]
[null,null,null,null,null,"Calentador a Gas",null,null,0,"Tecnología solar ",null,null,null,null,0,null,0," En transmilenio",null,0,"Nunca",{"$f":"IF(U66=\"Nunca\",0,IF(U66=\"3 veces por semana\",\"513\",IF(U66=\"5 veces por semana\",855,IF(U66=\"Todos los días\",1197))))","v":0},"No dejo restos de alimentos",0,0,0,0,0]
[null,null,null,null,null,"Calentador a Gas",null,null,{"$f":"IF(F67=\"Calentador a Gas\",(H67*1.6*1.98*30),IF(F67=\"Calentador Eléctrico\",(H67*1.3*0.199*30),IF(F67=\"Ducha Eléctrica\",(H67*4*0.199*30),IF(F67=\"Ninguno\",\"0\"))))","v":0},"Tecnología solar ",null,null,null,null,{"$f":"IF(J67=\"Ahorradores \",(K67*0.02*5*0.199*30),IF(J67=\"Incandescentes \",(M67*0.1*5*0.199*30),IF(J67=\"LED\",(L67*0.007*5*0.199*30),IF(J67=\"Tecnología solar \",(N67*0)))))","v":0},null,{"$f":"P67*9*0.8312","v":0}," En transmilenio",null,{"$f":"IF(R67=\"En bicicleta\",(0*S67),IF(R67=\"En carro\",(0.218 *S67),IF(R67=\"En bus o SITP \",((0.78703*S67)/40),IF(R67=\" En transmilenio\",((0.68516*S67)/140)))))","v":0},"Nunca",0,"No dejo restos de alimentos",0,{"$f":"V67+T67+Q67+O67+I67+X67","v":0},{"$f":"Y67/1000","v":0},{"$f":"Y67*12","v":0},0]
[null,null,null,null,null,"Calentador a Gas",null,null,0,"Tecnología solar ",null,null,null,null,0,null,0," En transmilenio",null,0,"Nunca",0,"No dejo restos de alimentos",0,0,0,0,0]
[null,null,null,null,null,"Calentador a Gas",null,null,0,"Tecnología solar ",null,null,null,null,0,null,0," En transmilenio",null,0,"Nunca",0,"No dejo restos de alimentos",{"$f":"IF(W69=\"No dejo restos de alimentos\",(0),IF(W69=\"Un cuarto del plato\",(0.25*0.5*0.8312*30),IF(W69=\"La mitad del plato\",(0.5*0.5*0.8312*30),IF(W69=\"Tres cuartos del plato\",(0.75*0.5*0.8312*30)))))","v":0},0,0,0,0]
[null,null,null,null,null,"Calentador a Gas",null,null,0,"Tecnología solar ",null,null,null,null,0,null,0," En transmilenio",null,0,"Nunca",0,"No dejo restos de alimentos",0,0,0,0,0]
[null,null,null,null,null,"Calentador a Gas",null,null,0,"Tecnología solar ",null,null,null,null,0,null,0," En transmilenio",null,0,"Nunca",0,"No dejo restos de alimentos",0,0,0,0,0]
[null,null,null,null,null,"Calentador a Gas",null,null,0,"Tecnología solar ",null,null,null,null,0,null,0," En transmilenio",null,0,"Nunca",0,"No dejo restos de alimentos",0,0,0,0,0]
[null,null,null,null,null,"Calentador a Gas",null,null,0,"Tecnología solar ",null,null,null,null,0,null,0," En transmilenio",null,0,"Nunca",0,"No dejo restos de alimentos",0,0,0,0,0]
[null,null,null,null,null,"Calentador a Gas",null,null,0,"Tecnología solar ",null,null,null,null,0,null,0," En transmilenio",null,0,"Nunca",0,"No dejo restos de alimentos",0,0,0,0,0]
[null,null,null,null,null,"Calentador a Gas",null,null,0,"Tecnología solar ",null,null,null,null,0,null,0," En transmilenio",null,0,"Nunca",0,"No dejo restos de alimentos",0,0,0,0,0]
[null,null,null,null,null,"Calentador a Gas",null,null,0,"Tecnología solar ",null,null,null,null,0,null,0," En transmilenio",null,0,"Nunca",0,"No dejo restos de alimentos",0,0,0,0,0]
[null,null,null,null,null,"Calentador a Gas",null,null,0,"Tecnología solar ",null,null,null,null,0,null,0," En transmilenio",null,0,"Nunca",0,"No dejo restos de alimentos",0,0,0,0,0]
[null,null,null,null,null,"Calentador a Gas",null,null,0,"Tecnología solar ",null,null,null,null,0,null,0," En transmilenio",null,0,"Nunca",0,"No dejo restos de alimentos",0,0,0,0,0]
[null,null,null,null,null,"Calentador a Gas",null,null,0,"Tecnología solar ",null,null,null,null,0,null,0," En transmilenio",null,0,"Nunca",0,"No dejo restos de alimentos",0,0,0,0,0]
[null,null,null,null,null,"Calentador a Gas",null,null,0,"Tecnología solar ",null,null,null,null,0,null,0," En transmilenio",null,0,"Nunca",0,"No dejo restos de alimentos",0,0,0,0,0]
[null,null,null,null,null,"Calentador a Gas",null,null,0,"Tecnología solar ",null,null,null,null,0,null,0," En transmilenio",null,0,"Nunca",0,"No dejo restos de alimentos",0,0,0,0,0]
[null,null,null,null,null,"Calentador a Gas",null,null,0,"Tecnología solar ",null,null,null,null,0,null,0," En transmilenio",null,0,"Nunca",0,"No dejo restos de alimentos",0,0,0,0,0]
[null,null,null,null,null,"Calentador a Gas",null,null,0,"Tecnología solar ",null,null,null,null,0,null,0," En transmilenio",null,0,"Nunca",0,"No dejo restos de alimentos",0,0,0,0,0]
[null,null,null,null,null,"Calentador a Gas",null,null,0,"Tecnología solar ",null,null,null,null,0,null,0," En transmilenio",null,0,"Nunca",0,"No dejo restos de alimentos",0,0,0,0,0]
[null,null,null,null,null,"Calentador a Gas",null,null,0,"Tecnología solar ",null,null,null,null,0,null,0," En transmilenio",null,0,"Nunca",0,"No dejo restos de alimentos",0,0,0,0,0]
[null,null,null,null,null,"Calentador a Gas",null,null,0,"Tecnología solar ",null,null,null,null,0,null,0," En transmilenio",null,0,"Nunca",0,"No dejo restos de alimentos",0,0,0,0,0]
[null,null,null,null,null,"Calentador a Gas",null,null,0,"Tecnología solar ",null,null,null,null,0,null,0," En transmilenio",null,0,"Nunca",0,"No dejo restos de alimentos",0,0,0,0,0]
[null,null,null,null,null,"Calentador a Gas",null,null,0,"Tecnología solar ",null,null,null,null,0,null,0," En transmilenio",null,0,"Nunca",0,"No dejo restos de alimentos",0,0,0,0,0]
[null,null,null,null,null,"Calentador a Gas",null,null,0,"Tecnología solar ",null,null,null,null,0,null,0," En transmilenio",null,0,"Nunca",0,"No dejo restos de alimentos",0,0,0,0,0]
[null,null,null,null,null,"Calentador a Gas",null,null,0,"Tecnología solar ",null,null,null,null,0,null,0," En transmilenio",null,0,"Nunca",0,"No dejo restos de alimentos",0,0,0,0,0]
[null,null,null,null,null,"Calentador a Gas",null,null,0,"Tecnología solar ",null,null,null,null,0,null,0," En transmilenio",null,0,"Nunca",0,"No dejo restos de alimentos",0,0,0,0,0]
[null,null,null,null,null,"Calentador a Gas",null,null,0,"Tecnología solar ",null,null,null,null,0,null,0," En transmilenio",null,0,"Nunca",0,"No dejo restos de alimentos",0,0,0,0,0]
[null,null,null,null,null,"Calentador a Gas",null,null,0,"Tecnología solar ",null,null,null,null,0,null,0," En transmilenio",null,0,"Nunca",0,"No dejo restos de alimentos",0,0,0,0,0]
[null,null,null,null,null,"Calentador a Gas",null,null,0,"Tecnología solar ",null,null,null,null,0,null,0," En transmilenio",null,0,"Nunca",0,"No dejo restos de alimentos",0,0,0,0,0]
[null,null,null,null,null,"Calentador a Gas",null,null,0,"Tecnología solar ",null,null,null,null,0,null,0," En transmilenio",null,0,"Nunca",0,"No dejo restos de alimentos",0,0,0,0,0]
[null,null,null,null,null,"Calentador a Gas",null,null,0,"Tecnología solar ",null,null,null,null,0,null,0," En transmilenio",null,0,"Nunca",0,"No dejo restos de alimentos",0,0,0,0,0]
[null,null,null,null,null,"Calentador a Gas",null,null,0,"Tecnología solar ",null,null,null,null,0,null,0," En transmilenio",null,0,"Nunca",0,"No dejo restos de alimentos",0,0,0,0,0]
[null,null,null,null,null,"Calentador a Gas",null,null,0,"Tecnología solar ",null,null,null,null,0,null,0," En transmilenio",null,0,"Nunca",0,"No dejo restos de alimentos",0,0,0,0,0]
[null,null,null,null,null,"Calentador a Gas",null,null,0,"Tecnología solar ",null,null,null,null,0,null,0," En transmilenio",null,0,"Nunca",0,"No dejo restos de alimentos",0,0,0,0,0]
[null,null,null,null,null,"Calentador a Gas",null,null,0,"Tecnología solar ",null,null,null,null,0,null,0," En transmilenio",null,0,"Nunca",0,"No dejo restos de alimentos",0,0,0,0,0]
[null,null,null,null,null,"Calentador a Gas",null,null,0,"Tecnología solar ",null,null,null,null,0,null,0," En transmilenio",null,0,"Nunca",0,"No dejo restos de alimentos",0,0,0,0,0]
[null,null,null,null,null,"Calentador a Gas",null,null,0,"Tecnología solar ",null,null,null,null,0,null,0," En transmilenio",null,0,"Nunca",0,"No dejo restos de alimentos",0,0,0,0,0]
[null,null,null,null,null,"Calentador a Gas",null,null,0,"Tecnología solar ",null,null,null,null,0,null,0," En transmilenio",null,0,"Nunca",0,"No dejo restos de alimentos",0,0,0,0,0]
[null,null,null,null,null,"Calentador a Gas",null,null,0,"Tecnología solar ",null,null,null,null,0,null,0," En transmilenio",null,0,"Nunca",0,"No dejo restos de alimentos",0,0,0,0,0]
[null,null,null,null,null,"Calentador a Gas",null,null,0,"Tecnología solar ",null,null,null,null,0,null,0," En transmilenio",null,0,"Nunca",0,"No dejo restos de alimentos",0,0,0,0,0]
[null,null,null,null,null,"Calentador a Gas",null,null,0,"Tecnología solar ",null,null,null,null,0,null,0," En transmilenio",null,0,"Nunca",0,"No dejo restos de alimentos",0,0,0,0,0]
[null,null,null,null,null,"Calentador a Gas",null,null,0,"Tecnología solar ",null,null,null,null,0,null,0," En transmilenio",null,0,"Nunca",0,"No dejo restos de alimentos",0,0,0,0,0]
[null,null,null,null,null,"Calentador a Gas",null,null,0,"Tecnología solar ",null,null,null,null,0,null,0," En transmilenio",null,0,"Nunca",0,"No dejo restos de alimentos",0,0,0,0,0]
[null,null,null,null,null,"Calentador a Gas",null,null,0,"Tecnología solar ",null,null,null,null,0,null,0," En transmilenio",null,0,"Nunca",0,"No dejo restos de alimentos",0,0,0,0,0]
[null,null,null,null,null,"Calentador a Gas",null,null,0,"Tecnología solar ",null,null,null,null,0,null,0," En transmilenio",null,0,"Nunca",0,"No dejo restos de alimentos",0,0,0,0,0]
[null,null,null,null,null,"Calentador a Gas",null,null,0,"Tecnología solar ",null,null,null,null,0,null,0," En transmilenio",null,0,"Nunca",0,"No dejo restos de alimentos",0,0,0,0,0]
[null,null,null,null,null,"Calentador a Gas",null,null,0,"Tecnología solar ",null,null,null,null,0,null,0," En transmilenio",null,0,"Nunca",0,"No dejo restos de alimentos",0,0,0,0,0]
[null,null,null,null,null,"Calentador a Gas",null,null,0,"Tecnología solar ",null,null,null,null,0,null,0," En transmilenio",null,0,"Nunca",0,"No dejo restos de alimentos",0,0,0,0,0]
[null,null,null,null,null,"Calentador a Gas",null,null,0,"Tecnología solar ",null,null,null,null,0,null,0," En transmilenio",null,0,"Nunca",0,"No dejo restos de alimentos",0,0,0,0,0]
[null,null,null,null,null,"Calentador a Gas",null,null,0,"Tecnología solar ",null,null,null,null,0,null,0," En transmilenio",null,0,"Nunca",0,"No dejo restos de alimentos",0,0,0,0,0]
[null,null,null,null,null,"Calentador a Gas",null,null,0,"Tecnología solar ",null,null,null,null,0,null,0," En transmilenio",null,0,"Nunca",0,"No dejo restos de alimentos",0,0,0,0,0]
[null,null,null,null,null,"Calentador a Gas",null,null,0,"Tecnología solar ",null,null,null,null,0,null,0," En transmilenio",null,0,"Nunca",0,"No dejo restos de alimentos",0,0,0,0,0]
[null,null,null,null,null,"Calentador a Gas",null,null,0,"Tecnología solar ",null,null,null,null,0,null,0," En transmilenio",null,0,"Nunca",0,"No dejo restos de alimentos",0,0,0,0,0]
[null,null,null,null,null,"Calentador a Gas",null,null,0,"Tecnología solar ",null,null,null,null,0,null,0," En transmilenio",null,0,"Nunca",0,"No dejo restos de alimentos",0,0,0,0,0]
[null,null,null,null,null,"Calentador a Gas",null,null,0,"Tecnología solar ",null,null,null,null,0,null,0," En transmilenio",null,0,"Nunca",0,"No dejo restos de alimentos",0,0,0,0,0]
[null,null,null,null,null,"Calentador a Gas",null,null,0,"Tecnología solar ",null,null,null,null,0,null,0," En transmilenio",null,0,"Nunca",0,"No dejo restos de alimentos",0,0,0,0,0]
[null,null,null,null,null,"Calentador a Gas",null,null,0,"Tecnología solar ",null,null,null,null,0,null,0," En transmilenio",null,0,"Nunca",0,"No dejo restos de alimentos",0,0,0,0,0]
[null,null,null,null,null,"Calentador a Gas",null,null,0,"Tecnología solar ",null,null,null,null,0,null,0," En transmilenio",null,0,"Nunca",0,"No dejo restos de alimentos",0,0,0,0,0]
[null,null,null,null,null,"Calentador a Gas",null,null,0,"Tecnología solar ",null,null,null,null,0,null,0," En transmilenio",null,0,"Nunca",0,"No dejo restos de alimentos",0,0,0,0,0]
[null,null,null,null,null,"Calentador a Gas",null,null,0,"Tecnología solar ",null,null,null,null,0,null,0," En transmilenio",null,0,"Nunca",0,"No dejo restos de alimentos",0,0,0,0,0]
[null,null,null,null,null,"Calentador a Gas",null,null,0,"Tecnología solar ",null,null,null,null,0,null,0," En transmilenio",null,0,"Nunca",0,"No dejo restos de alimentos",0,0,0,0,0]
[null,null,null,null,null,"Calentador a Gas",null,null,0,"Tecnología solar ",null,null,null,null,0,null,0," En transmilenio",null,0,"Nunca",0,"No dejo restos de alimentos",0,0,0,0,0]
[null,null,null,null,null,"Calentador a Gas",null,null,0,"Tecnología solar ",null,null,null,null,0,null,0," En transmilenio",null,0,"Nunca",0,"No dejo restos de alimentos",0,0,0,0,0]
[null,null,null,null,null,"Calentador a Gas",null,null,0,"Tecnología solar ",null,null,null,null,0,null,0," En transmilenio",null,0,"Nunca",0,"No dejo restos de alimentos",0,0,0,0,0]
[null,null,null,null,null,"Calentador a Gas",null,null,0,"Tecnología solar ",null,null,null,null,0,null,0," En transmilenio",null,0,"Nunca",{"$f":"IF(U130=\"Nunca\",0,IF(U130=\"3 veces por semana\",\"513\",IF(U130=\"5 veces por semana\",855,IF(U130=\"Todos los días\",1197))))","v":0},"No dejo restos de alimentos",0,0,0,0,0]
[null,null,null,null,null,"Calentador a Gas",null,null,{"$f":"IF(F131=\"Calentador a Gas\",(H131*1.6*1.98*30),IF(F131=\"Calentador Eléctrico\",(H131*1.3*0.199*30),IF(F131=\"Ducha Eléctrica\",(H131*4*0.199*30),IF(F131=\"Ninguno\",\"0\"))))","v":0},"Tecnología solar ",null,null,null,null,{"$f":"IF(J131=\"Ahorradores \",(K131*0.02*5*0.199*30),IF(J131=\"Incandescentes \",(M131*0.1*5*0.199*30),IF(J131=\"LED\",(L131*0.007*5*0.199*30),IF(J131=\"Tecnología solar \",(N131*0)))))","v":0},null,{"$f":"P131*9*0.8312","v":0}," En transmilenio",null,{"$f":"IF(R131=\"En bicicleta\",(0*S131),IF(R131=\"En carro\",(0.218 *S131),IF(R131=\"En bus o SITP \",((0.78703*S131)/40),IF(R131=\" En transmilenio\",((0.68516*S131)/140)))))","v":0},"Nunca",0,"No dejo restos de alimentos",0,{"$f":"V131+T131+Q131+O131+I131+X131","v":0},{"$f":"Y131/1000","v":0},{"$f":"Y131*12","v":0},0]
[null,null,null,null,null,"Calentador a Gas",null,null,0,"Tecnología solar ",null,null,null,null,0,null,0," En transmilenio",null,0,"Nunca",0,"No dejo restos de alimentos",0,0,0,0,0]
[null,null,null,null,null,"Calentador a Gas",null,null,0,"Tecnología solar ",null,null,null,null,0,null,0," En transmilenio",null,0,"Nunca",0,"No dejo restos de alimentos",{"$f":"IF(W133=\"No dejo restos de alimentos\",(0),IF(W133=\"Un cuarto del plato\",(0.25*0.5*0.8312*30),IF(W133=\"La mitad del plato\",(0.5*0.5*0.8312*30),IF(W133=\"Tres cuartos del plato\",(0.75*0.5*0.8312*30)))))","v":0},0,0,0,0]
[null,null,null,null,null,"Calentador a Gas",null,null,0,"Tecnología solar ",null,null,null,null,0,null,0," En transmilenio",null,0,"Nunca",0,"No dejo restos de alimentos",0,0,0,0,0]
[null,null,null,null,null,"Calentador a Gas",null,null,0,"Tecnología solar ",null,null,null,null,0,null,0," En transmilenio",null,0,"Nunca",0,"No dejo restos de alimentos",0,0,0,0,0]
[null,null,null,null,null,"Calentador a Gas",null,null,0,"Tecnología solar ",null,null,null,null,0,null,0," En transmilenio",null,0,"Nunca",0,"No dejo restos de alimentos",0,0,0,0,0]
[null,null,null,null,null,"Calentador a Gas",null,null,0,"Tecnología solar ",null,null,null,null,0,null,0," En transmilenio",null,0,"Nunca",0,"No dejo restos de alimentos",0,0,0,0,0]
[null,null,null,null,null,"Calentador a Gas",null,null,0,"Tecnología solar ",null,null,null,null,0,null,0," En transmilenio",null,0,"Nunca",0,"No dejo restos de alimentos",0,0,0,0,0]
[null,null,null,null,null,"Calentador a Gas",null,null,0,"Tecnología solar ",null,null,null,null,0,null,0," En transmilenio",null,0,"Nunca",0,"No dejo restos de alimentos",0,0,0,0,0]
[null,null,null,null,null,"Calentador a Gas",null,null,0,"Tecnología solar ",null,null,null,null,0,null,0," En transmilenio",null,0,"Nunca",0,"No dejo restos de alimentos",0,0,0,0,0]
[null,null,null,null,null,"Calentador a Gas",null,null,0,"Tecnología solar ",null,null,null,null,0,null,0," En transmilenio",null,0,"Nunca",0,"No dejo restos de alimentos",0,0,0,0,0]
[null,null,null,null,null,"Calentador a Gas",null,null,0,"Tecnología solar ",null,null,null,null,0,null,0," En transmilenio",null,0,"Nunca",0,"No dejo restos de alimentos",0,0,0,0,0]
[null,null,null,null,null,"Calentador a Gas",null,null,0,"Tecnología solar ",null,null,null,null,0,null,0," En transmilenio",null,0,"Nunca",0,"No dejo restos de alimentos",0,0,0,0,0]
[null,null,null,null,null,"Calentador a Gas",null,null,0,"Tecnología solar ",null,null,null,null,0,null,0," En transmilenio",null,0,"Nunca",0,"No dejo restos de alimentos",0,0,0,0,0]
[null,null,null,null,null,"Calentador a Gas",null,null,0,"Tecnología solar ",null,null,null,null,0,null,0," En transmilenio",null,0,"Nunca",0,"No dejo restos de alimentos",0,0,0,0,0]
[null,null,null,null,null,"Calentador a Gas",null,null,0,"Tecnología solar ",null,null,null,null,0,null,0," En transmilenio",null,0,"Nunca",0,"No dejo restos de alimentos",0,0,0,0,0]
[null,null,null,null,null,"Calentador a Gas",null,null,0,"Tecnología solar ",null,null,null,null,0,null,0," En transmilenio",null,0,"Nunca",0,"No dejo restos de alimentos",0,0,0,0,0]
[null,null,null,null,null,"Calentador a Gas",null,null,0,"Tecnología solar ",null,null,null,null,0,null,0," En transmilenio",null,0,"Nunca",0,"No dejo restos de alimentos",0,0,0,0,0]
[null,null,null,null,null,"Calentador a Gas",null,null,0,"Tecnología solar ",null,null,null,null,0,null,0," En transmilenio",null,0,"Nunca",0,"No dejo restos de alimentos",0,0,0,0,0]
[null,null,null,null,null,"Calentador a Gas",null,null,0,"Tecnología solar ",null,null,null,null,0,null,0," En transmilenio",null,0,"Nunca",0,"No dejo restos de alimentos",0,0,0,0,0]
[null,null,null,null,null,"Calentador a Gas",null,null,0,"Tecnología solar ",null,null,null,null,0,null,0," En transmilenio",null,0,"Nunca",0,"No dejo restos de alimentos",0,0,0,0,0]
[null,null,null,null,null,"Calentador a Gas",null,null,0,"Tecnología solar ",null,null,null,null,0,null,0," En transmilenio",null,0,"Nunca",0,"No dejo restos de alimentos",0,0,0,0,0]
[null,null,null,null,null,"Calentador a Gas",null,null,0,"Tecnología solar ",null,null,null,null,0,null,0," En transmilenio",null,0,"Nunca",0,"No dejo restos de alimentos",0,0,0,0,0]
[null,null,null,null,null,"Calentador a Gas",null,null,0,"Tecnología solar ",null,null,null,null,0,null,0," En transmilenio",null,0,"Nunca",0,"No dejo restos de alimentos",0,0,0,0,0]
[null,null,null,null,null,"Calentador a Gas",null,null,0,"Tecnología solar ",null,null,null,null,0,null,0," En transmilenio",null,0,"Nunca",0,"No dejo restos de alimentos",0,0,0,0,0]
[null,null,null,null,null,"Calentador a Gas",null,null,0,"Tecnología solar ",null,null,null,null,0,null,0," En transmilenio",null,0,"Nunca",0,"No dejo restos de alimentos",0,0,0,0,0]
[null,null,null,null,null,"Calentador a Gas",null,null,0,"Tecnología solar ",null,null,null,null,0,null,0," En transmilenio",null,0,"Nunca",0,"No dejo restos de alimentos",0,0,0,0,0]
[null,null,null,null,null,"Calentador a Gas",null,null,0,"Tecnología solar ",null,null,null,null,0,null,0," En transmilenio",null,0,"Nunca",0,"No dejo restos de alimentos",0,0,0,0,0]
[null,null,null,null,null,"Calentador a Gas",null,null,0,"Tecnología solar ",null,null,null,null,0,null,0," En transmilenio",null,0,"Nunca",0,"No dejo restos de alimentos",0,0,0,0,0]
[null,null,null,null,null,"Calentador a Gas",null,null,0,"Tecnología solar ",null,null,null,null,0,null,0," En transmilenio",null,0,"Nunca",0,"No dejo restos de alimentos",0,0,0,0,0]
[null,null,null,null,null,"Calentador a Gas",null,null,0,"Tecnología solar ",null,null,null,null,0,null,0," En transmilenio",null,0,"Nunca",0,"No dejo restos de alimentos",0,0,0,0,0]
[null,null,null,null,null,"Calentador a Gas",null,null,0,"Tecnología solar ",null,null,null,null,0,null,0," En transmilenio",null,0,"Nunca",0,"No dejo restos de alimentos",0,0,0,0,0]
[null,null,null,null,null,"Calentador a Gas",null,null,0,"Tecnología solar ",null,null,null,null,0,null,0," En transmilenio",null,0,"Nunca",0,"No dejo restos de alimentos",0,0,0,0,0]
[null,null,null,null,null,"Calentador a Gas",null,null,0,"Tecnología solar ",null,null,null,null,0,null,0," En transmilenio",null,0,"Nunca",0,"No dejo restos de alimentos",0,0,0,0,0]
[null,null,null,null,null,"Calentador a Gas",null,null,0,"Tecnología solar ",null,null,null,null,0,null,0," En transmilenio",null,0,"Nunca",0,"No dejo restos de alimentos",0,0,0,0,0]
[null,null,null,null,null,"Calentador a Gas",null,null,0,"Tecnología solar ",null,null,null,null,0,null,0," En transmilenio",null,0,"Nunca",0,"No dejo restos de alimentos",0,0,0,0,0]
[null,null,null,null,null,"Calentador a Gas",null,null,0,"Tecnología solar ",null,null,null,null,0,null,0," En transmilenio",null,0,"Nunca",0,"No dejo restos de alimentos",0,0,0,0,0]
[null,null,null,null,null,"Calentador a Gas",null,null,0,"Tecnología solar ",null,null,null,null,0,null,0," En transmilenio",null,0,"Nunca",0,"No dejo restos de alimentos",0,0,0,0,0]
[null,null,null,null,null,"Calentador a Gas",null,null,0,"Tecnología solar ",null,null,null,null,0,null,0," En transmilenio",null,0,"Nunca",0,"No dejo restos de alimentos",0,0,0,0,0]
[null,null,null,null,null,"Calentador a Gas",null,null,0,"Tecnología solar ",null,null,null,null,0,null,0," En transmilenio",null,0,"Nunca",0,"No dejo restos de alimentos",0,0,0,0,0]
[null,null,null,null,null,"Calentador a Gas",null,null,0,"Tecnología solar ",null,null,null,null,0,null,0," En transmilenio",null,0,"Nunca",0,"No dejo restos de alimentos",0,0,0,0,0]
[null,null,null,null,null,"Calentador a Gas",null,null,0,"Tecnología solar ",null,null,null,null,0,null,0," En transmilenio",null,0,"Nunca",0,"No dejo restos de alimentos",0,0,0,0,0]
[null,null,null,null,null,"Calentador a Gas",null,null,0,"Tecnología solar ",null,null,null,null,0,null,0," En transmilenio",null,0,"Nunca",0,"No dejo restos de alimentos",0,0,0,0,0]
[null,null,null,null,null,"Calentador a Gas",null,null,0,"Tecnología solar ",null,null,null,null,0,null,0," En transmilenio",null,0,"Nunca",0,"No dejo restos de alimentos",0,0,0,0,0]
[null,null,null,null,null,"Calentador a Gas",null,null,0,"Tecnología solar ",null,null,null,null,0,null,0," En transmilenio",null,0,"Nunca",0,"No dejo restos de alimentos",0,0,0,0,0]
[null,null,null,null,null,"Calentador a Gas",null,null,0,"Tecnología solar ",null,null,null,null,0,null,0," En transmilenio",null,0,"Nunca",0,"No dejo restos de alimentos",0,0,0,0,0]
[null,null,null,null,null,"Calentador a Gas",null,null,0,"Tecnología solar ",null,null,null,null,0,null,0," En transmilenio",null,0,"Nunca",0,"No dejo restos de alimentos",0,0,0,0,0]
[null,null,null,null,null,"Calentador a Gas",null,null,0,"Tecnología solar ",null,null,null,null,0,null,0," En transmilenio",null,0,"Nunca",0,"No dejo restos de alimentos",0,0,0,0,0]
[null,null,null,null,null,"Calentador a Gas",null,null,0,"Tecnología solar ",null,null,null,null,0,null,0," En transmilenio",null,0,"Nunca",0,"No dejo restos de alimentos",0,0,0,0,0]
[null,null,null,null,null,"Calentador a Gas",null,null,0,"Tecnología solar ",null,null,null,null,0,null,0," En transmilenio",null,0,"Nunca",0,"No dejo restos de alimentos",0,0,0,0,0]
[null,null,null,null,null,"Calentador a Gas",null,null,0,"Tecnología solar ",null,null,null,null,0,null,0," En transmilenio",null,0,"Nunca",0,"No dejo restos de alimentos",0,0,0,0,0]
[null,null,null,null,null,"Calentador a Gas",null,null,0,"Tecnología solar ",null,null,null,null,0,null,0," En transmilenio",null,0,"Nunca",0,"No dejo restos de alimentos",0,0,0,0,0]
[null,null,null,null,null,"Calentador a Gas",null,null,0,"Tecnología solar ",null,null,null,null,0,null,0," En transmilenio",null,0,"Nunca",0,"No dejo restos de alimentos",0,0,0,0,0]
[null,null,null,null,null,"Calentador a Gas",null,null,0,"Tecnología solar ",null,null,null,null,0,null,0," En transmilenio",null,0,"Nunca",0,"No dejo restos de alimentos",0,0,0,0,0]
[null,null,null,null,null,"Calentador a Gas",null,null,0,"Tecnología solar ",null,null,null,null,0,null,0," En transmilenio",null,0,"Nunca",0,"No dejo restos de alimentos",0,0,0,0,0]
[null,null,null,null,null,"Calentador a Gas",null,null,0,"Tecnología solar ",null,null,null,null,0,null,0," En transmilenio",null,0,"Nunca",0,"No dejo restos de alimentos",0,0,0,0,0]
[null,null,null,null,null,"Calentador a Gas",null,null,0,"Tecnología solar ",null,null,null,null,0,null,0," En transmilenio",null,0,"Nunca",0,"No dejo restos de alimentos",0,0,0,0,0]
[null,null,null,null,null,"Calentador a Gas",null,null,0,"Tecnología solar ",null,null,null,null,0,null,0," En transmilenio",null,0,"Nunca",0,"No dejo restos de alimentos",0,0,0,0,0]
[null,null,null,null,null,"Calentador a Gas",null,null,0,"Tecnología solar ",null,null,null,null,0,null,0," En transmilenio",null,0,"Nunca",0,"No dejo restos de alimentos",0,0,0,0,0]
[null,null,null,null,null,"Calentador a Gas",null,null,0,"Tecnología solar ",null,null,null,null,0,null,0," En transmilenio",null,0,"Nunca",0,"No dejo restos de alimentos",0,0,0,0,0]
[null,null,null,null,null,"Calentador a Gas",null,null,0,"Tecnología solar ",null,null,null,null,0,null,0," En transmilenio",null,0,"Nunca",0,"No dejo restos de alimentos",0,0,0,0,0]
[null,null,null,null,null,"Calentador a Gas",null,null,0,"Tecnología solar ",null,null,null,null,0,null,0," En transmilenio",null,0,"Nunca",0,"No dejo restos de alimentos",0,0,0,0,0]
[null,null,null,null,null,"Calentador a Gas",null,null,0,"Tecnología solar ",null,null,null,null,0,null,0," En transmilenio",null,0,"Nunca",0,"No dejo restos de alimentos",0,0,0,0,0]
[null,null,null,null,null,"Calentador a Gas",null,null,0,"Tecnología solar ",null,null,null,null,0,null,0," En transmilenio",null,0,"Nunca",{"$f":"IF(U194=\"Nunca\",0,IF(U194=\"3 veces por semana\",\"513\",IF(U194=\"5 veces por semana\",855,IF(U194=\"Todos los días\",1197))))","v":0},"No dejo restos de alimentos",0,0,0,0,0]
[null,null,null,null,null,"Calentador a Gas",null,null,{"$f":"IF(F195=\"Calentador a Gas\",(H195*1.6*1.98*30),IF(F195=\"Calentador Eléctrico\",(H195*1.3*0.199*30),IF(F195=\"Ducha Eléctrica\",(H195*4*0.199*30),IF(F195=\"Ninguno\",\"0\"))))","v":0},"Tecnología solar ",null,null,null,null,{"$f":"IF(J195=\"Ahorradores \",(K195*0.02*5*0.199*30),IF(J195=\"Incandescentes \",(M195*0.1*5*0.199*30),IF(J195=\"LED\",(L195*0.007*5*0.199*30),IF(J195=\"Tecnología solar \",(N195*0)))))","v":0},null,{"$f":"P195*9*0.8312","v":0}," En transmilenio",null,{"$f":"IF(R195=\"En bicicleta\",(0*S195),IF(R195=\"En carro\",(0.218 *S195),IF(R195=\"En bus o SITP \",((0.78703*S195)/40),IF(R195=\" En transmilenio\",((0.68516*S195)/140)))))","v":0},"Nunca",0,"No dejo restos de alimentos",0,{"$f":"V195+T195+Q195+O195+I195+X195","v":0},{"$f":"Y195/1000","v":0},{"$f":"Y195*12","v":0},0]
[null,null,null,null,null,"Calentador a Gas",null,null,0,"Tecnología solar ",null,null,null,null,0,null,0," En transmilenio",null,0,"Nunca",0,"No dejo restos de alimentos",0,0,0,0,0]
[null,null,null,null,null,"Calentador a Gas",null,null,0,"Tecnología solar ",null,null,null,null,0,null,0," En transmilenio",null,0,"Nunca",0,"No dejo restos de alimentos",{"$f":"IF(W197=\"No dejo restos de alimentos\",(0),IF(W197=\"Un cuarto del plato\",(0.25*0.5*0.8312*30),IF(W197=\"La mitad del plato\",(0.5*0.5*0.8312*30),IF(W197=\"Tres cuartos del plato\",(0.75*0.5*0.8312*30)))))","v":0},0,0,0,0]
[null,null,null,null,null,"Calentador a Gas",null,null,0,"Tecnología solar ",null,null,null,null,0,null,0," En transmilenio",null,0,"Nunca",0,"No dejo restos de alimentos",0,0,0,0,0]
[null,null,null,null,null,"Calentador a Gas",null,null,0,"Tecnología solar ",null,null,null,null,0,null,0," En transmilenio",null,0,"Nunca",0,"No dejo restos de alimentos",0,0,0,0,0]
[null,null,null,null,null,"Calentador a Gas",null,null,0,"Tecnología solar ",null,null,null,null,0,null,0," En transmilenio",null,0,"Nunca",0,"No dejo restos de alimentos",0,0,0,0,0]
[null,null,null,null,null,"Calentador a Gas",null,null,0,"Tecnología solar ",null,null,null,null,0,null,0," En transmilenio",null,0,"Nunca",0,"No dejo restos de alimentos",0,0,0,0,0]
[null,null,null,null,null,"Calentador a Gas",null,null,0,"Tecnología solar ",null,null,null,null,0,null,0," En transmilenio",null,0,"Nunca",0,"No dejo restos de alimentos",0,0,0,0,0]
[null,null,null,null,null,"Calentador a Gas",null,null,0,"Tecnología solar ",null,null,null,null,0,null,0," En transmilenio",null,0,"Nunca",0,"No dejo restos de alimentos",0,0,0,0,0]
[null,null,null,null,null,"Calentador a Gas",null,null,0,"Tecnología solar ",null,null,null,null,0,null,0," En transmilenio",null,0,"Nunca",0,"No dejo restos de alimentos",0,0,0,0,0]
[null,null,null,null,null,"Calentador a Gas",null,null,0,"Tecnología solar ",null,null,null,null,0,null,0," En transmilenio",null,0,"Nunca",0,"No dejo restos de alimentos",0,0,0,0,0]
[null,null,null,null,null,"Calentador a Gas",null,null,0,"Tecnología solar ",null,null,null,null,0,null,0," En transmilenio",null,0,"Nunca",0,"No dejo restos de alimentos",0,0,0,0,0]
[null,null,null,null,null,"Calentador a Gas",null,null,0,"Tecnología solar ",null,null,null,null,0,null,0," En transmilenio",null,0,"Nunca",0,"No dejo restos de alimentos",0,0,0,0,0]
[null,null,null,null,null,"Calentador a Gas",null,null,0,"Tecnología solar ",null,null,null,null,0,null,0," En transmilenio",null,0,"Nunca",0,"No dejo restos de alimentos",0,0,0,0,0]
[null,null,null,null,null,"Calentador a Gas",null,null,0,"Tecnología solar ",null,null,null,null,0,null,0," En transmilenio",null,0,"Nunca",0,"No dejo restos de alimentos",0,0,0,0,0]
[null,null,null,null,null,"Calentador a Gas",null,null,0,"Tecnología solar ",null,null,null,null,0,null,0," En transmilenio",null,0,"Nunca",0,"No dejo restos de alimentos",0,0,0,0,0]
[null,null,null,null,null,"Calentador a Gas",null,null,0,"Tecnología solar ",null,null,null,null,0,null,0," En transmilenio",null,0,"Nunca",0,"No dejo restos de alimentos",0,0,0,0,0]
[null,null,null,null,null,"Calentador a Gas",null,null,0,"Tecnología solar ",null,null,null,null,0,null,0," En transmilenio",null,0,"Nunca",0,"No dejo restos de alimentos",0,0,0,0,0]
[null,null,null,null,null,"Calentador a Gas",null,null,0,"Tecnología solar ",null,null,null,null,0,null,0," En transmilenio",null,0,"Nunca",0,"No dejo restos de alimentos",0,0,0,0,0]
[null,null,null,null,null,"Calentador a Gas",null,null,0,"Tecnología solar ",null,null,null,null,0,null,0," En transmilenio",null,0,"Nunca",0,"No dejo restos de alimentos",0,0,0,0,0]
[null,null,null,null,null,"Calentador a Gas",null,null,0,"Tecnología solar ",null,null,null,null,0,null,0," En transmilenio",null,0,"Nunca",0,"No dejo restos de alimentos",0,0,0,0,0]
[null,null,null,null,null,"Calentador a Gas",null,null,0,"Tecnología solar ",null,null,null,null,0,null,0," En transmilenio",null,0,"Nunca",0,"No dejo restos de alimentos",0,0,0,0,0]
[null,null,null,null,null,"Calentador a Gas",null,null,0,"Tecnología solar ",null,null,null,null,0,null,0," En transmilenio",null,0,"Nunca",0,"No dejo restos de alimentos",0,0,0,0,0]
[null,null,null,null,null,"Calentador a Gas",null,null,0,"Tecnología solar ",null,null,null,null,0,null,0," En transmilenio",null,0,"Nunca",0,"No dejo restos de alimentos",0,0,0,0,0]
[null,null,null,null,null,"Calentador a Gas",null,null,0,"Tecnología solar ",null,null,null,null,0,null,0," En transmilenio",null,0,"Nunca",0,"No dejo restos de alimentos",0,0,0,0,0]
[null,null,null,null,null,"Calentador a Gas",null,null,0,"Tecnología solar ",null,null,null,null,0,null,0," En transmilenio",null,0,"Nunca",0,"No dejo restos de alimentos",0,0,0,0,0]
[null,null,null,null,null,"Calentador a Gas",null,null,0,"Tecnología solar ",null,null,null,null,0,null,0," En transmilenio",null,0,"Nunca",0,"No dejo restos de alimentos",0,0,0,0,0]
[null,null,null,null,null,"Calentador a Gas",null,null,0,"Tecnología solar ",null,null,null,null,0,null,0," En transmilenio",null,0,"Nunca",0,"No dejo restos de alimentos",0,0,0,0,0]
[null,null,null,null,null,"Calentador a Gas",null,null,0,"Tecnología solar ",null,null,null,null,0,null,0," En transmilenio",null,0,"Nunca",0,"No dejo restos de alimentos",0,0,0,0,0]
[null,null,null,null,null,"Calentador a Gas",null,null,0,"Tecnología solar ",null,null,null,null,0,null,0," En transmilenio",null,0,"Nunca",0,"No dejo restos de alimentos",0,0,0,0,0]
[null,null,null,null,null,"Calentador a Gas",null,null,0,"Tecnología solar ",null,null,null,null,0,null,0," En transmilenio",null,0,"Nunca",0,"No dejo restos de alimentos",0,0,0,0,0]
[null,null,null,null,null,"Calentador a Gas",null,null,0,"Tecnología solar ",null,null,null,null,0,null,0," En transmilenio",null,0,"Nunca",0,"No dejo restos de alimentos",0,0,0,0,0]
[null,null,null,null,null,"Calentador a Gas",null,null,0,"Tecnología solar ",null,null,null,null,0,null,0," En transmilenio",null,0,"Nunca",0,"No dejo restos de alimentos",0,0,0,0,0]
[null,null,null,null,null,"Calentador a Gas",null,null,0,"Tecnología solar ",null,null,null,null,0,null,0," En transmilenio",null,0,"Nunca",0,"No dejo restos de alimentos",0,0,0,0,0]
[null,null,null,null,null,"Calentador a Gas",null,null,0,"Tecnología solar ",null,null,null,null,0,null,0," En transmilenio",null,0,"Nunca",0,"No dejo restos de alimentos",0,0,0,0,0]
[null,null,null,null,null,"Calentador a Gas",null,null,0,"Tecnología solar ",null,null,null,null,0,null,0," En transmilenio",null,0,"Nunca",0,"No dejo restos de alimentos",0,0,0,0,0]
[null,null,null,null,null,"Calentador a Gas",null,null,0,"Tecnología solar ",null,null,null,null,0,null,0," En transmilenio",null,0,"Nunca",0,"No dejo restos de alimentos",0,0,0,0,0]
[null,null,null,null,null,"Calentador a Gas",null,null,0,"Tecnología solar ",null,null,null,null,0,null,0," En transmilenio",null,0,"Nunca",0,"No dejo restos de alimentos",0,0,0,0,0]
[null,null,null,null,null,"Calentador a Gas",null,null,0,"Tecnología solar ",null,null,null,null,0,null,0," En transmilenio",null,0,"Nunca",0,"No dejo restos de alimentos",0,0,0,0,0]
[null,null,null,null,null,"Calentador a Gas",null,null,0,"Tecnología solar ",null,null,null,null,0,null,0," En transmilenio",null,0,"Nunca",0,"No dejo restos de alimentos",0,0,0,0,0]
[null,null,null,null,null,"Calentador a Gas",null,null,0,"Tecnología solar ",null,null,null,null,0,null,0," En transmilenio",null,0,"Nunca",0,"No dejo restos de alimentos",0,0,0,0,0]
[null,null,null,null,null,"Calentador a Gas",null,null,0,"Tecnología solar ",null,null,null,null,0,null,0," En transmilenio",null,0,"Nunca",0,"No dejo restos de alimentos",0,0,0,0,0]
[null,null,null,null,null,"Calentador a Gas",null,null,0,"Tecnología solar ",null,null,null,null,0,null,0," En transmilenio",null,0,"Nunca",0,"No dejo restos de alimentos",0,0,0,0,0]
[null,null,null,null,null,"Calentador a Gas",null,null,0,"Tecnología solar ",null,null,null,null,0,null,0," En transmilenio",null,0,"Nunca",0,"No dejo restos de alimentos",0,0,0,0,0]
[null,null,null,null,null,"Calentador a Gas",null,null,0,"Tecnología solar ",null,null,null,null,0,null,0," En transmilenio",null,0,"Nunca",0,"No dejo restos de alimentos",0,0,0,0,0]
[null,null,null,null,null,"Calentador a Gas",null,null,0,"Tecnología solar ",null,null,null,null,0,null,0," En transmilenio",null,0,"Nunca",0,"No dejo restos de alimentos",0,0,0,0,0]
[null,null,null,null,null,"Calentador a Gas",null,null,0,"Tecnología solar ",null,null,null,null,0,null,0," En transmilenio",null,0,"Nunca",0,"No dejo restos de alimentos",0,0,0,0,0]
[null,null,null,null,null,"Calentador a Gas",null,null,0,"Tecnología solar ",null,null,null,null,0,null,0," En transmilenio",null,0,"Nunca",0,"No dejo restos de alimentos",0,0,0,0,0]
[null,null,null,null,null,"Calentador a Gas",null,null,0,"Tecnología solar ",null,null,null,null,0,null,0," En transmilenio",null,0,"Nunca",0,"No dejo restos de alimentos",0,0,0,0,0]
[null,null,null,null,null,"Calentador a Gas",null,null,0,"Tecnología solar ",null,null,null,null,0,null,0," En transmilenio",null,0,"Nunca",0,"No dejo restos de alimentos",0,0,0,0,0]
[null,null,null,null,null,"Calentador a Gas",null,null,0,"Tecnología solar ",null,null,null,null,0,null,0," En transmilenio",null,0,"Nunca",0,"No dejo restos de alimentos",0,0,0,0,0]
[null,null,null,null,null,"Calentador a Gas",null,null,0,"Tecnología solar ",null,null,null,null,0,null,0," En transmilenio",null,0,"Nunca",0,"No dejo restos de alimentos",0,0,0,0,0]
[null,null,null,null,null,"Calentador a Gas",null,null,0,"Tecnología solar ",null,null,null,null,0,null,0," En transmilenio",null,0,"Nunca",0,"No dejo restos de alimentos",0,0,0,0,0]
[null,null,null,null,null,"Calentador a Gas",null,null,0,"Tecnología solar ",null,null,null,null,0,null,0," En transmilenio",null,0,"Nunca",0,"No dejo restos de alimentos",0,0,0,0,0]
[null,null,null,null,null,"Calentador a Gas",null,null,0,"Tecnología solar ",null,null,null,null,0,null,0," En transmilenio",null,0,"Nunca",0,"No dejo restos de alimentos",0,0,0,0,0]
[null,null,null,null,null,"Calentador a Gas",null,null,0,"Tecnología solar ",null,null,null,null,0,null,0," En transmilenio",null,0,"Nunca",0,"No dejo restos de alimentos",0,0,0,0,0]
[null,null,null,null,null,"Calentador a Gas",null,null,0,"Tecnología solar ",null,null,null,null,0,null,0," En transmilenio",null,0,"Nunca",0,"No dejo restos de alimentos",0,0,0,0,0]
[null,null,null,null,null,"Calentador a Gas",null,null,0,"Tecnología solar ",null,null,null,null,0,null,0," En transmilenio",null,0,"Nunca",0,"No dejo restos de alimentos",0,0,0,0,0]
[null,null,null,null,null,"Calentador a Gas",null,null,0,"Tecnología solar ",null,null,null,null,0,null,0," En transmilenio",null,0,"Nunca",0,"No dejo restos de alimentos",0,0,0,0,0]
[null,null,null,null,null,"Calentador a Gas",null,null,0,"Tecnología solar ",null,null,null,null,0,null,0," En transmilenio",null,0,"Nunca",0,"No dejo restos de alimentos",0,0,0,0,0]
[null,null,null,null,null,"Calentador a Gas",null,null,0,"Tecnología solar ",null,null,null,null,0,null,0," En transmilenio",null,0,"Nunca",0,"No dejo restos de alimentos",0,0,0,0,0]
[null,null,null,null,null,"Calentador a Gas",null,null,0,"Tecnología solar ",null,null,null,null,0,null,0," En transmilenio",null,0,"Nunca",0,"No dejo restos de alimentos",0,0,0,0,0]
[null,null,null,null,null,"Calentador a Gas",null,null,0,"Tecnología solar ",null,null,null,null,0,null,0," En transmilenio",null,0,"Nunca",0,"No dejo restos de alimentos",0,0,0,0,0]
[null,null,null,null,null,"Calentador a Gas",null,null,0,"Tecnología solar ",null,null,null,null,0,null,0," En transmilenio",null,0,"Nunca",{"$f":"IF(U258=\"Nunca\",0,IF(U258=\"3 veces por semana\",\"513\",IF(U258=\"5 veces por semana\",855,IF(U258=\"Todos los días\",1197))))","v":0},"No dejo restos de alimentos",0,0,0,0,0]
[null,null,null,null,null,"Calentador a Gas",null,null,{"$f":"IF(F259=\"Calentador a Gas\",(H259*1.6*1.98*30),IF(F259=\"Calentador Eléctrico\",(H259*1.3*0.199*30),IF(F259=\"Ducha Eléctrica\",(H259*4*0.199*30),IF(F259=\"Ninguno\",\"0\"))))","v":0},"Tecnología solar ",null,null,null,null,{"$f":"IF(J259=\"Ahorradores \",(K259*0.02*5*0.199*30),IF(J259=\"Incandescentes \",(M259*0.1*5*0.199*30),IF(J259=\"LED\",(L259*0.007*5*0.199*30),IF(J259=\"Tecnología solar \",(N259*0)))))","v":0},null,{"$f":"P259*9*0.8312","v":0}," En transmilenio",null,{"$f":"IF(R259=\"En bicicleta\",(0*S259),IF(R259=\"En carro\",(0.218 *S259),IF(R259=\"En bus o SITP \",((0.78703*S259)/40),IF(R259=\" En transmilenio\",((0.68516*S259)/140)))))","v":0},"Nunca",0,"No dejo restos de alimentos",0,{"$f":"V259+T259+Q259+O259+I259+X259","v":0},{"$f":"Y259/1000","v":0},{"$f":"Y259*12","v":0},0]
[null,null,null,null,null,"Calentador a Gas",null,null,0,"Tecnología solar ",null,null,null,null,0,null,0," En transmilenio",null,0,"Nunca",0,"No dejo restos de alimentos",0,0,0,0,0]
[null,null,null,null,null,"Calentador a Gas",null,null,0,"Tecnología solar ",null,null,null,null,0,null,0," En transmilenio",null,0,"Nunca",0,"No dejo restos de alimentos",{"$f":"IF(W261=\"No dejo restos de alimentos\",(0),IF(W261=\"Un cuarto del plato\",(0.25*0.5*0.8312*30),IF(W261=\"La mitad del plato\",(0.5*0.5*0.8312*30),IF(W261=\"Tres cuartos del plato\",(0.75*0.5*0.8312*30)))))","v":0},0,0,0,0]
[null,null,null,null,null,"Calentador a Gas",null,null,0,"Tecnología solar ",null,null,null,null,0,null,0," En transmilenio",null,0,"Nunca",0,"No dejo restos de alimentos",0,0,0,0,0]
[null,null,null,null,null,"Calentador a Gas",null,null,0,"Tecnología solar ",null,null,null,null,0,null,0," En transmilenio",null,0,"Nunca",0,"No dejo restos de alimentos",0,0,0,0,0]
[null,null,null,null,null,"Calentador a Gas",null,null,0,"Tecnología solar ",null,null,null,null,0,null,0," En transmilenio",null,0,"Nunca",0,"No dejo restos de alimentos",0,0,0,0,0]
[null,null,null,null,null,"Calentador a Gas",null,null,0,"Tecnología solar ",null,null,null,null,0,null,0," En transmilenio",null,0,"Nunca",0,"No dejo restos de alimentos",0,0,0,0,0]
[null,null,null,null,null,"Calentador a Gas",null,null,0,"Tecnología solar ",null,null,null,null,0,null,0," En transmilenio",null,0,"Nunca",0,"No dejo restos de alimentos",0,0,0,0,0]
[null,null,null,null,null,"Calentador a Gas",null,null,0,"Tecnología solar ",null,null,null,null,0,null,0," En transmilenio",null,0,"Nunca",0,"No dejo restos de alimentos",0,0,0,0,0]
[null,null,null,null,null,"Calentador a Gas",null,null,0,"Tecnología solar ",null,null,null,null,0,null,0," En transmilenio",null,0,"Nunca",0,"No dejo restos de alimentos",0,0,0,0,0]
[null,null,null,null,null,"Calentador a Gas",null,null,0,"Tecnología solar ",null,null,null,null,0,null,0," En transmilenio",null,0,"Nunca",0,"No dejo restos de alimentos",0,0,0,0,0]
[null,null,null,null,null,"Calentador a Gas",null,null,0,"Tecnología solar ",null,null,null,null,0,null,0," En transmilenio",null,0,"Nunca",0,"No dejo restos de alimentos",0,0,0,0,0]
[null,null,null,null,null,"Calentador a Gas",null,null,0,"Tecnología solar ",null,null,null,null,0,null,0," En transmilenio",null,0,"Nunca",0,"No dejo restos de alimentos",0,0,0,0,0]
[null,null,null,null,null,"Calentador a Gas",null,null,0,"Tecnología solar ",null,null,null,null,0,null,0," En transmilenio",null,0,"Nunca",0,"No dejo restos de alimentos",0,0,0,0,0]
[null,null,null,null,null,"Calentador a Gas",null,null,0,"Tecnología solar ",null,null,null,null,0,null,0," En transmilenio",null,0,"Nunca",0,"No dejo restos de alimentos",0,0,0,0,0]
[null,null,null,null,null,"Calentador a Gas",null,null,0,"Tecnología solar ",null,null,null,null,0,null,0," En transmilenio",null,0,"Nunca",0,"No dejo restos de alimentos",0,0,0,0,0]
[null,null,null,null,null,"Calentador a Gas",null,null,0,"Tecnología solar ",null,null,null,null,0,null,0," En transmilenio",null,0,"Nunca",0,"No dejo restos de alimentos",0,0,0,0,0]
[null,null,null,null,null,"Calentador a Gas",null,null,0,"Tecnología solar ",null,null,null,null,0,null,0," En transmilenio",null,0,"Nunca",0,"No dejo restos de alimentos",0,0,0,0,0]
[null,null,null,null,null,"Calentador a Gas",null,null,0,"Tecnología solar ",null,null,null,null,0,null,0," En transmilenio",null,0,"Nunca",0,"No dejo restos de alimentos",0,0,0,0,0]
[null,null,null,null,null,"Calentador a Gas",null,null,0,"Tecnología solar ",null,null,null,null,0,null,0," En transmilenio",null,0,"Nunca",0,"No dejo restos de alimentos",0,0,0,0,0]
[null,null,null,null,null,"Calentador a Gas",null,null,0,"Tecnología solar ",null,null,null,null,0,null,0," En transmilenio",null,0,"Nunca",0,"No dejo restos de alimentos",0,0,0,0,0]
[null,null,null,null,null,"Calentador a Gas",null,null,0,"Tecnología solar ",null,null,null,null,0,null,0," En transmilenio",null,0,"Nunca",0,"No dejo restos de alimentos",0,0,0,0,0]
[null,null,null,null,null,"Calentador a Gas",null,null,0,"Tecnología solar ",null,null,null,null,0,null,0," En transmilenio",null,0,"Nunca",0,"No dejo restos de alimentos",0,0,0,0,0]
[null,null,null,null,null,"Calentador a Gas",null,null,0,"Tecnología solar ",null,null,null,null,0,null,0," En transmilenio",null,0,"Nunca",0,"No dejo restos de alimentos",0,0,0,0,0]
[null,null,null,null,null,"Calentador a Gas",null,null,0,"Tecnología solar ",null,null,null,null,0,null,0," En transmilenio",null,0,"Nunca",0,"No dejo restos de alimentos",0,0,0,0,0]
[null,null,null,null,null,"Calentador a Gas",null,null,0,"Tecnología solar ",null,null,null,null,0,null,0," En transmilenio",null,0,"Nunca",0,"No dejo restos de alimentos",0,0,0,0,0]
[null,null,null,null,null,"Calentador a Gas",null,null,0,"Tecnología solar ",null,null,null,null,0,null,0," En transmilenio",null,0,"Nunca",0,"No dejo restos de alimentos",0,0,0,0,0]
[null,null,null,null,null,"Calentador a Gas",null,null,0,"Tecnología solar ",null,null,null,null,0,null,0," En transmilenio",null,0,"Nunca",0,"No dejo restos de alimentos",0,0,0,0,0]
[null,null,null,null,null,"Calentador a Gas",null,null,0,"Tecnología solar ",null,null,null,null,0,null,0," En transmilenio",null,0,"Nunca",0,"No dejo restos de alimentos",0,0,0,0,0]
[null,null,null,null,null,"Calentador a Gas",null,null,0,"Tecnología solar ",null,null,null,null,0,null,0," En transmilenio",null,0,"Nunca",0,"No dejo restos de alimentos",0,0,0,0,0]
[null,null,null,null,null,"Calentador a Gas",null,null,0,"Tecnología solar ",null,null,null,null,0,null,0," En transmilenio",null,0,"Nunca",0,"No dejo restos de alimentos",0,0,0,0,0]
[null,null,null,null,null,"Calentador a Gas",null,null,0,"Tecnología solar ",null,null,null,null,0,null,0," En transmilenio",null,0,"Nunca",0,"No dejo restos de alimentos",0,0,0,0,0]
[null,null,null,null,null,"Calentador a Gas",null,null,0,"Tecnología solar ",null,null,null,null,0,null,0," En transmilenio",null,0,"Nunca",0,"No dejo restos de alimentos",0,0,0,0,0]
[null,null,null,null,null,"Calentador a Gas",null,null,0,"Tecnología solar ",null,null,null,null,0,null,0," En transmilenio",null,0,"Nunca",0,"No dejo restos de alimentos",0,0,0,0,0]
[null,null,null,null,null,"Calentador a Gas",null,null,0,"Tecnología solar ",null,null,null,null,0,null,0," En transmilenio",null,0,"Nunca",0,"No dejo restos de alimentos",0,0,0,0,0]
[null,null,null,null,null,"Calentador a Gas",null,null,0,"Tecnología solar ",null,null,null,null,0,null,0," En transmilenio",null,0,"Nunca",0,"No dejo restos de alimentos",0,0,0,0,0]
[null,null,null,null,null,"Calentador a Gas",null,null,0,"Tecnología solar ",null,null,null,null,0,null,0," En transmilenio",null,0,"Nunca",0,"No dejo restos de alimentos",0,0,0,0,0]
[null,null,null,null,null,"Calentador a Gas",null,null,0,"Tecnología solar ",null,null,null,null,0,null,0," En transmilenio",null,0,"Nunca",0,"No dejo restos de alimentos",0,0,0,0,0]
[null,null,null,null,null,"Calentador a Gas",null,null,0,"Tecnología solar ",null,null,null,null,0,null,0," En transmilenio",null,0,"Nunca",0,"No dejo restos de alimentos",0,0,0,0,0]
[null,null,null,null,null,"Calentador a Gas",null,null,0,"Tecnología solar ",null,null,null,null,0,null,0," En transmilenio",null,0,"Nunca",0,"No dejo restos de alimentos",0,0,0,0,0]
[null,null,null,null,null,"Calentador a Gas",null,null,0,"Tecnología solar ",null,null,null,null,0,null,0," En transmilenio",null,0,"Nunca",0,"No dejo restos de alimentos",0,0,0,0,0]
[null,null,null,null,null,"Calentador a Gas",null,null,0,"Tecnología solar ",null,null,null,null,0,null,0," En transmilenio",null,0,"Nunca",0,"No dejo restos de alimentos",0,0,0,0,0]
[null,null,null,null,null,"Calentador a Gas",null,null,0,"Tecnología solar ",null,null,null,null,0,null,0," En transmilenio",null,0,"Nunca",0,"No dejo restos de alimentos",0,0,0,0,0]
[null,null,null,null,null,"Calentador a Gas",null,null,0,"Tecnología solar ",null,null,null,null,0,null,0," En transmilenio",null,0,"Nunca",0,"No dejo restos de alimentos",0,0,0,0,0]
[null,null,null,null,null,"Calentador a Gas",null,null,0,"Tecnología solar ",null,null,null,null,0,null,0," En transmilenio",null,0,"Nunca",0,"No dejo restos de alimentos",0,0,0,0,0]
[null,null,null,null,null,"Calentador a Gas",null,null,0,"Tecnología solar ",null,null,null,null,0,null,0," En transmilenio",null,0,"Nunca",0,"No dejo restos de alimentos",0,0,0,0,0]
[null,null,null,null,null,"Calentador a Gas",null,null,0,"Tecnología solar ",null,null,null,null,0,null,0," En transmilenio",null,0,"Nunca",0,"No dejo restos de alimentos",0,0,0,0,0]
[null,null,null,null,null,"Calentador a Gas",null,null,0,"Tecnología solar ",null,null,null,null,0,null,0," En transmilenio",null,0,"Nunca",0,"No dejo restos de alimentos",0,0,0,0,0]
[null,null,null,null,null,"Calentador a Gas",null,null,0,"Tecnología solar ",null,null,null,null,0,null,0," En transmilenio",null,0,"Nunca",0,"No dejo restos de alimentos",0,0,0,0,0]
[null,null,null,null,null,"Calentador a Gas",null,null,0,"Tecnología solar ",null,null,null,null,0,null,0," En transmilenio",null,0,"Nunca",0,"No dejo restos de alimentos",0,0,0,0,0]
[null,null,null,null,null,"Calentador a Gas",null,null,0,"Tecnología solar ",null,null,null,null,0,null,0," En transmilenio",null,0,"Nunca",0,"No dejo restos de alimentos",0,0,0,0,0]
[null,null,null,null,null,"Calentador a Gas",null,null,0,"Tecnología solar ",null,null,null,null,0,null,0," En transmilenio",null,0,"Nunca",0,"No dejo restos de alimentos",0,0,0,0,0]
[null,null,null,null,null,"Calentador a Gas",null,null,0,"Tecnología solar ",null,null,null,null,0,null,0," En transmilenio",null,0,"Nunca",0,"No dejo restos de alimentos",0,0,0,0,0]
[null,null,null,null,null,"Calentador a Gas",null,null,0,"Tecnología solar ",null,null,null,null,0,null,0," En transmilenio",null,0,"Nunca",0,"No dejo restos de alimentos",0,0,0,0,0]
[null,null,null,null,null,"Calentador a Gas",null,null,0,"Tecnología solar ",null,null,null,null,0,null,0," En transmilenio",null,0,"Nunca",0,"No dejo restos de alimentos",0,0,0,0,0]
[null,null,null,null,null,"Calentador a Gas",null,null,0,"Tecnología solar ",null,null,null,null,0,null,0," En transmilenio",null,0,"Nunca",0,"No dejo restos de alimentos",0,0,0,0,0]
[null,null,null,null,null,"Calentador a Gas",null,null,0,"Tecnología solar ",null,null,null,null,0,null,0," En transmilenio",null,0,"Nunca",0,"No dejo restos de alimentos",0,0,0,0,0]
[null,null,null,null,null,"Calentador a Gas",null,null,0,"Tecnología solar ",null,null,null,null,0,null,0," En transmilenio",null,0,"Nunca",0,"No dejo restos de alimentos",0,0,0,0,0]
[null,null,null,null,null,"Calentador a Gas",null,null,0,"Tecnología solar ",null,null,null,null,0,null,0," En transmilenio",null,0,"Nunca",0,"No dejo restos de alimentos",0,0,0,0,0]
[null,null,null,null,null,"Calentador a Gas",null,null,0,"Tecnología solar ",null,null,null,null,0,null,0," En transmilenio",null,0,"Nunca",0,"No dejo restos de alimentos",0,0,0,0,0]
[null,null,null,null,null,"Calentador a Gas",null,null,0,"Tecnología solar ",null,null,null,null,0,null,0," En transmilenio",null,0,"Nunca",0,"No dejo restos de alimentos",0,0,0,0,0]
[null,null,null,null,null,"Calentador a Gas",null,null,0,"Tecnología solar ",null,null,null,null,0,null,0," En transmilenio",null,0,"Nunca",0,"No dejo restos de alimentos",0,0,0,0,0]
[null,null,null,null,null,"Calentador a Gas",null,null,0,"Tecnología solar ",null,null,null,null,0,null,0," En transmilenio",null,0,"Nunca",0,"No dejo restos de alimentos",0,0,0,0,0]
[null,null,null,null,null,"Calentador a Gas",null,null,0,"Tecnología solar ",null,null,null,null,0,null,0," En transmilenio",null,0,"Nunca",{"$f":"IF(U322=\"Nunca\",0,IF(U322=\"3 veces por semana\",\"513\",IF(U322=\"5 veces por semana\",855,IF(U322=\"Todos los días\",1197))))","v":0},"No dejo restos de alimentos",0,0,0,0,0]
[null,null,null,null,null,"Calentador a Gas",null,null,{"$f":"IF(F323=\"Calentador a Gas\",(H323*1.6*1.98*30),IF(F323=\"Calentador Eléctrico\",(H323*1.3*0.199*30),IF(F323=\"Ducha Eléctrica\",(H323*4*0.199*30),IF(F323=\"Ninguno\",\"0\"))))","v":0},"Tecnología solar ",null,null,null,null,{"$f":"IF(J323=\"Ahorradores \",(K323*0.02*5*0.199*30),IF(J323=\"Incandescentes \",(M323*0.1*5*0.199*30),IF(J323=\"LED\",(L323*0.007*5*0.199*30),IF(J323=\"Tecnología solar \",(N323*0)))))","v":0},null,{"$f":"P323*9*0.8312","v":0}," En transmilenio",null,{"$f":"IF(R323=\"En bicicleta\",(0*S323),IF(R323=\"En carro\",(0.218 *S323),IF(R323=\"En bus o SITP \",((0.78703*S323)/40),IF(R323=\" En transmilenio\",((0.68516*S323)/140)))))","v":0},"Nunca",0,"No dejo restos de alimentos",0,{"$f":"V323+T323+Q323+O323+I323+X323","v":0},{"$f":"Y323/1000","v":0},{"$f":"Y323*12","v":0},0]
[null,null,null,null,null,"Calentador a Gas",null,null,0,"Tecnología solar ",null,null,null,null,0,null,0," En transmilenio",null,0,"Nunca",0,"No dejo restos de alimentos",0,0,0,0,0]
[null,null,null,null,null,"Calentador a Gas",null,null,0,"Tecnología solar ",null,null,null,null,0,null,0," En transmilenio",null,0,"Nunca",0,"No dejo restos de alimentos",{"$f":"IF(W325=\"No dejo restos de alimentos\",(0),IF(W325=\"Un cuarto del plato\",(0.25*0.5*0.8312*30),IF(W325=\"La mitad del plato\",(0.5*0.5*0.8312*30),IF(W325=\"Tres cuartos del plato\",(0.75*0.5*0.8312*30)))))","v":0},0,0,0,0]
[null,null,null,null,null,"Calentador a Gas",null,null,0,"Tecnología solar ",null,null,null,null,0,null,0," En transmilenio",null,0,"Nunca",0,"No dejo restos de alimentos",0,0,0,0,0]
[null,null,null,null,null,"Calentador a Gas",null,null,0,"Tecnología solar ",null,null,null,null,0,null,0," En transmilenio",null,0,"Nunca",0,"No dejo restos de alimentos",0,0,0,0,0]
[null,null,null,null,null,"Calentador a Gas",null,null,0,"Tecnología solar ",null,null,null,null,0,null,0," En transmilenio",null,0,"Nunca",0,"No dejo restos de alimentos",0,0,0,0,0]
[null,null,null,null,null,"Calentador a Gas",null,null,0,"Tecnología solar ",null,null,null,null,0,null,0," En transmilenio",null,0,"Nunca",0,"No dejo restos de alimentos",0,0,0,0,0]
[null,null,null,null,null,"Calentador a Gas",null,null,0,"Tecnología solar ",null,null,null,null,0,null,0," En transmilenio",null,0,"Nunca",0,"No dejo restos de alimentos",0,0,0,0,0]
[null,null,null,null,null,"Calentador a Gas",null,null,0,"Tecnología solar ",null,null,null,null,0,null,0," En transmilenio",null,0,"Nunca",0,"No dejo restos de alimentos",0,0,0,0,0]
[null,null,null,null,null,"Calentador a Gas",null,null,0,"Tecnología solar ",null,null,null,null,0,null,0," En transmilenio",null,0,"Nunca",0,"No dejo restos de alimentos",0,0,0,0,0]
[null,null,null,null,null,"Calentador a Gas",null,null,0,"Tecnología solar ",null,null,null,null,0,null,0," En transmilenio",null,0,"Nunca",0,"No dejo restos de alimentos",0,0,0,0,0]
[null,null,null,null,null,"Calentador a Gas",null,null,0,"Tecnología solar ",null,null,null,null,0,null,0," En transmilenio",null,0,"Nunca",0,"No dejo restos de alimentos",0,0,0,0,0]
[null,null,null,null,null,"Calentador a Gas",null,null,0,"Tecnología solar ",null,null,null,null,0,null,0," En transmilenio",null,0,"Nunca",0,"No dejo restos de alimentos",0,0,0,0,0]
[null,null,null,null,null,"Calentador a Gas",null,null,0,"Tecnología solar ",null,null,null,null,0,null,0," En transmilenio",null,0,"Nunca",0,"No dejo restos de alimentos",0,0,0,0,0]
[null,null,null,null,null,"Calentador a Gas",null,null,0,"Tecnología solar ",null,null,null,null,0,null,0," En transmilenio",null,0,"Nunca",0,"No dejo restos de alimentos",0,0,0,0,0]
[null,null,null,null,null,"Calentador a Gas",null,null,0,"Tecnología solar ",null,null,null,null,0,null,0," En transmilenio",null,0,"Nunca",0,"No dejo restos de alimentos",0,0,0,0,0]
[null,null,null,null,null,"Calentador a Gas",null,null,0,"Tecnología solar ",null,null,null,null,0,null,0," En transmilenio",null,0,"Nunca",0,"No dejo restos de alimentos",0,0,0,0,0]
[null,null,null,null,null,"Calentador a Gas",null,null,0,"Tecnología solar ",null,null,null,null,0,null,0," En transmilenio",null,0,"Nunca",0,"No dejo restos de alimentos",0,0,0,0,0]
[null,null,null,null,null,"Calentador a Gas",null,null,0,"Tecnología solar ",null,null,null,null,0,null,0," En transmilenio",null,0,"Nunca",0,"No dejo restos de alimentos",0,0,0,0,0]
[null,null,null,null,null,"Calentador a Gas",null,null,0,"Tecnología solar ",null,null,null,null,0,null,0," En transmilenio",null,0,"Nunca",0,"No dejo restos de alimentos",0,0,0,0,0]
[null,null,null,null,null,"Calentador a Gas",null,null,0,"Tecnología solar ",null,null,null,null,0,null,0," En transmilenio",null,0,"Nunca",0,"No dejo restos de alimentos",0,0,0,0,0]
[null,null,null,null,null,"Calentador a Gas",null,null,0,"Tecnología solar ",null,null,null,null,0,null,0," En transmilenio",null,0,"Nunca",0,"No dejo restos de alimentos",0,0,0,0,0]
[null,null,null,null,null,"Calentador a Gas",null,null,0,"Tecnología solar ",null,null,null,null,0,null,0," En transmilenio",null,0,"Nunca",0,"No dejo restos de alimentos",0,0,0,0,0]
[null,null,null,null,null,"Calentador a Gas",null,null,0,"Tecnología solar ",null,null,null,null,0,null,0," En transmilenio",null,0,"Nunca",0,"No dejo restos de alimentos",0,0,0,0,0]
[null,null,null,null,null,"Calentador a Gas",null,null,0,"Tecnología solar ",null,null,null,null,0,null,0," En transmilenio",null,0,"Nunca",0,"No dejo restos de alimentos",0,0,0,0,0]
[null,null,null,null,null,"Calentador a Gas",null,null,0,"Tecnología solar ",null,null,null,null,0,null,0," En transmilenio",null,0,"Nunca",0,"No dejo restos de alimentos",0,0,0,0,0]
[null,null,null,null,null,"Calentador a Gas",null,null,0,"Tecnología solar ",null,null,null,null,0,null,0," En transmilenio",null,0,"Nunca",0,"No dejo restos de alimentos",0,0,0,0,0]
[null,null,null,null,null,"Calentador a Gas",null,null,0,"Tecnología solar ",null,null,null,null,0,null,0," En transmilenio",null,0,"Nunca",0,"No dejo restos de alimentos",0,0,0,0,0]
[null,null,null,null,null,"Calentador a Gas",null,null,0,"Tecnología solar ",null,null,null,null,0,null,0," En transmilenio",null,0,"Nunca",0,"No dejo restos de alimentos",0,0,0,0,0]
[null,null,null,null,null,"Calentador a Gas",null,null,0,"Tecnología solar ",null,null,null,null,0,null,0," En transmilenio",null,0,"Nunca",0,"No dejo restos de alimentos",0,0,0,0,0]
[null,null,null,null,null,"Calentador a Gas",null,null,0,"Tecnología solar ",null,null,null,null,0,null,0," En transmilenio",null,0,"Nunca",0,"No dejo restos de alimentos",0,0,0,0,0]
[null,null,null,null,null,"Calentador a Gas",null,null,0,"Tecnología solar ",null,null,null,null,0,null,0," En transmilenio",null,0,"Nunca",0,"No dejo restos de alimentos",0,0,0,0,0]
[null,null,null,null,null,"Calentador a Gas",null,null,0,"Tecnología solar ",null,null,null,null,0,null,0," En transmilenio",null,0,"Nunca",0,"No dejo restos de alimentos",0,0,0,0,0]
[null,null,null,null,null,"Calentador a Gas",null,null,0,"Tecnología solar ",null,null,null,null,0,null,0," En transmilenio",null,0,"Nunca",0,"No dejo restos de alimentos",0,0,0,0,0]
[null,null,null,null,null,"Calentador a Gas",null,null,0,"Tecnología solar ",null,null,null,null,0,null,0," En transmilenio",null,0,"Nunca",0,"No dejo restos de alimentos",0,0,0,0,0]
[null,null,null,null,null,"Calentador a Gas",null,null,0,"Tecnología solar ",null,null,null,null,0,null,0," En transmilenio",null,0,"Nunca",0,"No dejo restos de alimentos",0,0,0,0,0]
[null,null,null,null,null,"Calentador a Gas",null,null,0,"Tecnología solar ",null,null,null,null,0,null,0," En transmilenio",null,0,"Nunca",0,"No dejo restos de alimentos",0,0,0,0,0]
[null,null,null,null,null,"Calentador a Gas",null,null,0,"Tecnología solar ",null,null,null,null,0,null,0," En transmilenio",null,0,"Nunca",0,"No dejo restos de alimentos",0,0,0,0,0]
[null,null,null,null,null,"Calentador a Gas",null,null,0,"Tecnología solar ",null,null,null,null,0,null,0," En transmilenio",null,0,"Nunca",0,"No dejo restos de alimentos",0,0,0,0,0]
[null,null,null,null,null,"Calentador a Gas",null,null,0,"Tecnología solar ",null,null,null,null,0,null,0," En transmilenio",null,0,"Nunca",0,"No dejo restos de alimentos",0,0,0,0,0]
[null,null,null,null,null,"Calentador a Gas",null,null,0,"Tecnología solar ",null,null,null,null,0,null,0," En transmilenio",null,0,"Nunca",0,"No dejo restos de alimentos",0,0,0,0,0]
[null,null,null,null,null,"Calentador a Gas",null,null,0,"Tecnología solar ",null,null,null,null,0,null,0," En transmilenio",null,0,"Nunca",0,"No dejo restos de alimentos",0,0,0,0,0]
[null,null,null,null,null,"Calentador a Gas",null,null,0,"Tecnología solar ",null,null,null,null,0,null,0," En transmilenio",null,0,"Nunca",0,"No dejo restos de alimentos",0,0,0,0,0]
[null,null,null,null,null,"Calentador a Gas",null,null,0,"Tecnología solar ",null,null,null,null,0,null,0," En transmilenio",null,0,"Nunca",0,"No dejo restos de alimentos",0,0,0,0,0]
[null,null,null,null,null,"Calentador a Gas",null,null,0,"Tecnología solar ",null,null,null,null,0,null,0," En transmilenio",null,0,"Nunca",0,"No dejo restos de alimentos",0,0,0,0,0]
[null,null,null,null,null,"Calentador a Gas",null,null,0,"Tecnología solar ",null,null,null,null,0,null,0," En transmilenio",null,0,"Nunca",0,"No dejo restos de alimentos",0,0,0,0,0]
[null,null,null,null,null,"Calentador a Gas",null,null,0,"Tecnología solar ",null,null,null,null,0,null,0," En transmilenio",null,0,"Nunca",0,"No dejo restos de alimentos",0,0,0,0,0]
[null,null,null,null,null,"Calentador a Gas",null,null,0,"Tecnología solar ",null,null,null,null,0,null,0," En transmilenio",null,0,"Nunca",0,"No dejo restos de alimentos",0,0,0,0,0]
[null,null,null,null,null,"Calentador a Gas",null,null,0,"Tecnología solar ",null,null,null,null,0,null,0," En transmilenio",null,0,"Nunca",0,"No dejo restos de alimentos",0,0,0,0,0]
[null,null,null,null,null,"Calentador a Gas",null,null,0,"Tecnología solar ",null,null,null,null,0,null,0," En transmilenio",null,0,"Nunca",0,"No dejo restos de alimentos",0,0,0,0,0]
[null,null,null,null,null,"Calentador a Gas",null,null,0,"Tecnología solar ",null,null,null,null,0,null,0," En transmilenio",null,0,"Nunca",0,"No dejo restos de alimentos",0,0,0,0,0]
[null,null,null,null,null,"Calentador a Gas",null,null,0,"Tecnología solar ",null,null,null,null,0,null,0," En transmilenio",null,0,"Nunca",0,"No dejo restos de alimentos",0,0,0,0,0]
[null,null,null,null,null,"Calentador a Gas",null,null,0,"Tecnología solar ",null,null,null,null,0,null,0," En transmilenio",null,0,"Nunca",0,"No dejo restos de alimentos",0,0,0,0,0]
[null,null,null,null,null,"Calentador a Gas",null,null,0,"Tecnología solar ",null,null,null,null,0,null,0," En transmilenio",null,0,"Nunca",0,"No dejo restos de alimentos",0,0,0,0,0]
[null,null,null,null,null,"Calentador a Gas",null,null,0,"Tecnología solar ",null,null,null,null,0,null,0," En transmilenio",null,0,"Nunca",0,"No dejo restos de alimentos",0,0,0,0,0]
[null,null,null,null,null,"Calentador a Gas",null,null,0,"Tecnología solar ",null,null,null,null,0,null,0," En transmilenio",null,0,"Nunca",0,"No dejo restos de alimentos",0,0,0,0,0]
[null,null,null,null,null,"Calentador a Gas",null,null,0,"Tecnología solar ",null,null,null,null,0,null,0," En transmilenio",null,0,"Nunca",0,"No dejo restos de alimentos",0,0,0,0,0]
[null,null,null,null,null,"Calentador a Gas",null,null,0,"Tecnología solar ",null,null,null,null,0,null,0," En transmilenio",null,0,"Nunca",0,"No dejo restos de alimentos",0,0,0,0,0]
[null,null,null,null,null,"Calentador a Gas",null,null,0,"Tecnología solar ",null,null,null,null,0,null,0," En transmilenio",null,0,"Nunca",0,"No dejo restos de alimentos",0,0,0,0,0]
[null,null,null,null,null,"Calentador a Gas",null,null,0,"Tecnología solar ",null,null,null,null,0,null,0," En transmilenio",null,0,"Nunca",0,"No dejo restos de alimentos",0,0,0,0,0]
[null,null,null,null,null,"Calentador a Gas",null,null,0,"Tecnología solar ",null,null,null,null,0,null,0," En transmilenio",null,0,"Nunca",0,"No dejo restos de alimentos",0,0,0,0,0]
[null,null,null,null,null,"Calentador a Gas",null,null,0,"Tecnología solar ",null,null,null,null,0,null,0," En transmilenio",null,0,"Nunca",0,"No dejo restos de alimentos",0,0,0,0,0]
[null,null,null,null,null,"Calentador a Gas",null,null,0,"Tecnología solar ",null,null,null,null,0,null,0," En transmilenio",null,0,"Nunca",0,"No dejo restos de alimentos",0,0,0,0,0]
[null,null,null,null,null,"Calentador a Gas",null,null,0,"Tecnología solar ",null,null,null,null,0,null,0," En transmilenio",null,0,"Nunca",{"$f":"IF(U386=\"Nunca\",0,IF(U386=\"3 veces por semana\",\"513\",IF(U386=\"5 veces por semana\",855,IF(U386=\"Todos los días\",1197))))","v":0},"No dejo restos de alimentos",0,0,0,0,0]
[null,null,null,null,null,"Calentador a Gas",null,null,{"$f":"IF(F387=\"Calentador a Gas\",(H387*1.6*1.98*30),IF(F387=\"Calentador Eléctrico\",(H387*1.3*0.199*30),IF(F387=\"Ducha Eléctrica\",(H387*4*0.199*30),IF(F387=\"Ninguno\",\"0\"))))","v":0},"Tecnología solar ",null,null,null,null,{"$f":"IF(J387=\"Ahorradores \",(K387*0.02*5*0.199*30),IF(J387=\"Incandescentes \",(M387*0.1*5*0.199*30),IF(J387=\"LED\",(L387*0.007*5*0.199*30),IF(J387=\"Tecnología solar \",(N387*0)))))","v":0},null,{"$f":"P387*9*0.8312","v":0}," En transmilenio",null,{"$f":"IF(R387=\"En bicicleta\",(0*S387),IF(R387=\"En carro\",(0.218 *S387),IF(R387=\"En bus o SITP \",((0.78703*S387)/40),IF(R387=\" En transmilenio\",((0.68516*S387)/140)))))","v":0},"Nunca",0,"No dejo restos de alimentos",0,{"$f":"V387+T387+Q387+O387+I387+X387","v":0},{"$f":"Y387/1000","v":0},{"$f":"Y387*12","v":0},0]
[null,null,null,null,null,"Calentador a Gas",null,null,0,"Tecnología solar ",null,null,null,null,0,null,0," En transmilenio",null,0,"Nunca",0,"No dejo restos de alimentos",0,0,0,0,0]
[null,null,null,null,null,"Calentador a Gas",null,null,0,"Tecnología solar ",null,null,null,null,0,null,0," En transmilenio",null,0,"Nunca",0,"No dejo restos de alimentos",{"$f":"IF(W389=\"No dejo restos de alimentos\",(0),IF(W389=\"Un cuarto del plato\",(0.25*0.5*0.8312*30),IF(W389=\"La mitad del plato\",(0.5*0.5*0.8312*30),IF(W389=\"Tres cuartos del plato\",(0.75*0.5*0.8312*30)))))","v":0},0,0,0,0]
[null,null,null,null,null,"Calentador a Gas",null,null,0,"Tecnología solar ",null,null,null,null,0,null,0," En transmilenio",null,0,"Nunca",0,"No dejo restos de alimentos",0,0,0,0,0]
[null,null,null,null,null,"Calentador a Gas",null,null,0,"Tecnología solar ",null,null,null,null,0,null,0," En transmilenio",null,0,"Nunca",0,"No dejo restos de alimentos",0,0,0,0,0]
[null,null,null,null,null,"Calentador a Gas",null,null,0,"Tecnología solar ",null,null,null,null,0,null,0," En transmilenio",null,0,"Nunca",0,"No dejo restos de alimentos",0,0,0,0,0]
[null,null,null,null,null,"Calentador a Gas",null,null,0,"Tecnología solar ",null,null,null,null,0,null,0," En transmilenio",null,0,"Nunca",0,"No dejo restos de alimentos",0,0,0,0,0]
[null,null,null,null,null,"Calentador a Gas",null,null,0,"Tecnología solar ",null,null,null,null,0,null,0," En transmilenio",null,0,"Nunca",0,"No dejo restos de alimentos",0,0,0,0,0]
[null,null,null,null,null,"Calentador a Gas",null,null,0,"Tecnología solar ",null,null,null,null,0,null,0," En transmilenio",null,0,"Nunca",0,"No dejo restos de alimentos",0,0,0,0,0]
[null,null,null,null,null,"Calentador a Gas",null,null,0,"Tecnología solar ",null,null,null,null,0,null,0," En transmilenio",null,0,"Nunca",0,"No dejo restos de alimentos",0,0,0,0,0]
[null,null,null,null,null,"Calentador a Gas",null,null,0,"Tecnología solar ",null,null,null,null,0,null,0," En transmilenio",null,0,"Nunca",0,"No dejo restos de alimentos",0,0,0,0,0]
[null,null,null,null,null,"Calentador a Gas",null,null,0,"Tecnología solar ",null,null,null,null,0,null,0," En transmilenio",null,0,"Nunca",0,"No dejo restos de alimentos",0,0,0,0,0]
[null,null,null,null,null,"Calentador a Gas",null,null,0,"Tecnología solar ",null,null,null,null,0,null,0," En transmilenio",null,0,"Nunca",0,"No dejo restos de alimentos",0,0,0,0,0]
[null,null,null,null,null,"Calentador a Gas",null,null,0,"Tecnología solar ",null,null,null,null,0,null,0," En transmilenio",null,0,"Nunca",0,"No dejo restos de alimentos",0,0,0,0,0]
[null,null,null,null,null,"Calentador a Gas",null,null,0,"Tecnología solar ",null,null,null,null,0,null,0," En transmilenio",null,0,"Nunca",0,"No dejo restos de alimentos",0,0,0,0,0]
[null,null,null,null,null,"Calentador a Gas",null,null,0,"Tecnología solar ",null,null,null,null,0,null,0," En transmilenio",null,0,"Nunca",0,"No dejo restos de alimentos",0,0,0,0,0]
[null,null,null,null,null,"Calentador a Gas",null,null,0,"Tecnología solar ",null,null,null,null,0,null,0," En transmilenio",null,0,"Nunca",0,"No dejo restos de alimentos",0,0,0,0,0]
[null,null,null,null,null,"Calentador a Gas",null,null,0,"Tecnología solar ",null,null,null,null,0,null,0," En transmilenio",null,0,"Nunca",0,"No dejo restos de alimentos",0,0,0,0,0]
[null,null,null,null,null,"Calentador a Gas",null,null,0,"Tecnología solar ",null,null,null,null,0,null,0," En transmilenio",null,0,"Nunca",0,"No dejo restos de alimentos",0,0,0,0,0]
[null,null,null,null,null,"Calentador a Gas",null,null,0,"Tecnología solar ",null,null,null,null,0,null,0," En transmilenio",null,0,"Nunca",0,"No dejo restos de alimentos",0,0,0,0,0]
[null,null,null,null,null,"Calentador a Gas",null,null,0,"Tecnología solar ",null,null,null,null,0,null,0," En transmilenio",null,0,"Nunca",0,"No dejo restos de alimentos",0,0,0,0,0]
[null,null,null,null,null,"Calentador a Gas",null,null,0,"Tecnología solar ",null,null,null,null,0,null,0," En transmilenio",null,0,"Nunca",0,"No dejo restos de alimentos",0,0,0,0,0]
[null,null,null,null,null,"Calentador a Gas",null,null,0,"Tecnología solar ",null,null,null,null,0,null,0," En transmilenio",null,0,"Nunca",0,"No dejo restos de alimentos",0,0,0,0,0]
[null,null,null,null,null,"Calentador a Gas",null,null,0,"Tecnología solar ",null,null,null,null,0,null,0," En transmilenio",null,0,"Nunca",0,"No dejo restos de alimentos",0,0,0,0,0]
[null,null,null,null,null,"Calentador a Gas",null,null,0,"Tecnología solar ",null,null,null,null,0,null,0," En transmilenio",null,0,"Nunca",0,"No dejo restos de alimentos",0,0,0,0,0]
[null,null,null,null,null,"Calentador a Gas",null,null,0,"Tecnología solar ",null,null,null,null,0,null,0," En transmilenio",null,0,"Nunca",0,"No dejo restos de alimentos",0,0,0,0,0]
[null,null,null,null,null,"Calentador a Gas",null,null,0,"Tecnología solar ",null,null,null,null,0,null,0," En transmilenio",null,0,"Nunca",0,"No dejo restos de alimentos",0,0,0,0,0]
[null,null,null,null,null,"Calentador a Gas",null,null,0,"Tecnología solar ",null,null,null,null,0,null,0," En transmilenio",null,0,"Nunca",0,"No dejo restos de alimentos",0,0,0,0,0]
[null,null,null,null,null,"Calentador a Gas",null,null,0,"Tecnología solar ",null,null,null,null,0,null,0," En transmilenio",null,0,"Nunca",0,"No dejo restos de alimentos",0,0,0,0,0]
[null,null,null,null,null,"Calentador a Gas",null,null,0,"Tecnología solar ",null,null,null,null,0,null,0," En transmilenio",null,0,"Nunca",0,"No dejo restos de alimentos",0,0,0,0,0]
[null,null,null,null,null,"Calentador a Gas",null,null,0,"Tecnología solar ",null,null,null,null,0,null,0," En transmilenio",null,0,"Nunca",0,"No dejo restos de alimentos",0,0,0,0,0]
[null,null,null,null,null,"Calentador a Gas",null,null,0,"Tecnología solar ",null,null,null,null,0,null,0," En transmilenio",null,0,"Nunca",0,"No dejo restos de alimentos",0,0,0,0,0]
[null,null,null,null,null,"Calentador a Gas",null,null,0,"Tecnología solar ",null,null,null,null,0,null,0," En transmilenio",null,0,"Nunca",0,"No dejo restos de alimentos",0,0,0,0,0]
[null,null,null,null,null,"Calentador a Gas",null,null,0,"Tecnología solar ",null,null,null,null,0,null,0," En transmilenio",null,0,"Nunca",0,"No dejo restos de alimentos",0,0,0,0,0]
[null,null,null,null,null,"Calentador a Gas",null,null,0,"Tecnología solar ",null,null,null,null,0,null,0," En transmilenio",null,0,"Nunca",0,"No dejo restos de alimentos",0,0,0,0,0]
[null,null,null,null,null,"Calentador a Gas",null,null,0,"Tecnología solar ",null,null,null,null,0,null,0," En transmilenio",null,0,"Nunca",0,"No dejo restos de alimentos",0,0,0,0,0]
[null,null,null,null,null,"Calentador a Gas",null,null,0,"Tecnología solar ",null,null,null,null,0,null,0," En transmilenio",null,0,"Nunca",0,"No dejo restos de alimentos",0,0,0,0,0]
[null,null,null,null,null,"Calentador a Gas",null,null,0,"Tecnología solar ",null,null,null,null,0,null,0," En transmilenio",null,0,"Nunca",0,"No dejo restos de alimentos",0,0,0,0,0]
[null,null,null,null,null,"Calentador a Gas",null,null,0,"Tecnología solar ",null,null,null,null,0,null,0," En transmilenio",null,0,"Nunca",0,"No dejo restos de alimentos",0,0,0,0,0]
[null,null,null,null,null,"Calentador a Gas",null,null,0,"Tecnología solar ",null,null,null,null,0,null,0," En transmilenio",null,0,"Nunca",0,"No dejo restos de alimentos",0,0,0,0,0]
[null,null,null,null,null,"Calentador a Gas",null,null,0,"Tecnología solar ",null,null,null,null,0,null,0," En transmilenio",null,0,"Nunca",0,"No dejo restos de alimentos",0,0,0,0,0]
[null,null,null,null,null,"Calentador a Gas",null,null,0,"Tecnología solar ",null,null,null,null,0,null,0," En transmilenio",null,0,"Nunca",0,"No dejo restos de alimentos",0,0,0,0,0]
[null,null,null,null,null,"Calentador a Gas",null,null,0,"Tecnología solar ",null,null,null,null,0,null,0," En transmilenio",null,0,"Nunca",0,"No dejo restos de alimentos",0,0,0,0,0]
[null,null,null,null,null,"Calentador a Gas",null,null,0,"Tecnología solar ",null,null,null,null,0,null,0," En transmilenio",null,0,"Nunca",0,"No dejo restos de alimentos",0,0,0,0,0]
[null,null,null,null,null,"Calentador a Gas",null,null,0,"Tecnología solar ",null,null,null,null,0,null,0," En transmilenio",null,0,"Nunca",0,"No dejo restos de alimentos",0,0,0,0,0]
[null,null,null,null,null,"Calentador a Gas",null,null,0,"Tecnología solar ",null,null,null,null,0,null,0," En transmilenio",null,0,"Nunca",0,"No dejo restos de alimentos",0,0,0,0,0]
[null,null,null,null,null,"Calentador a Gas",null,null,0,"Tecnología solar ",null,null,null,null,0,null,0," En transmilenio",null,0,"Nunca",0,"No dejo restos de alimentos",0,0,0,0,0]
[null,null,null,null,null,"Calentador a Gas",null,null,0,"Tecnología solar ",null,null,null,null,0,null,0," En transmilenio",null,0,"Nunca",0,"No dejo restos de alimentos",0,0,0,0,0]
[null,null,null,null,null,"Calentador a Gas",null,null,0,"Tecnología solar ",null,null,null,null,0,null,0," En transmilenio",null,0,"Nunca",0,"No dejo restos de alimentos",0,0,0,0,0]
[null,null,null,null,null,"Calentador a Gas",null,null,0,"Tecnología solar ",null,null,null,null,0,null,0," En transmilenio",null,0,"Nunca",0,"No dejo restos de alimentos",0,0,0,0,0]
[null,null,null,null,null,"Calentador a Gas",null,null,0,"Tecnología solar ",null,null,null,null,0,null,0," En transmilenio",null,0,"Nunca",0,"No dejo restos de alimentos",0,0,0,0,0]
[null,null,null,null,null,"Calentador a Gas",null,null,0,"Tecnología solar ",null,null,null,null,0,null,0," En transmilenio",null,0,"Nunca",0,"No dejo restos de alimentos",0,0,0,0,0]
[null,null,null,null,null,"Calentador a Gas",null,null,0,"Tecnología solar ",null,null,null,null,0,null,0," En transmilenio",null,0,"Nunca",0,"No dejo restos de alimentos",0,0,0,0,0]
[null,null,null,null,null,"Calentador a Gas",null,null,0,"Tecnología solar ",null,null,null,null,0,null,0," En transmilenio",null,0,"Nunca",0,"No dejo restos de alimentos",0,0,0,0,0]
[null,null,null,null,null,"Calentador a Gas",null,null,0,"Tecnología solar ",null,null,null,null,0,null,0," En transmilenio",null,0,"Nunca",0,"No dejo restos de alimentos",0,0,0,0,0]
[null,null,null,null,null,"Calentador a Gas",null,null,0,"Tecnología solar ",null,null,null,null,0,null,0," En transmilenio",null,0,"Nunca",0,"No dejo restos de alimentos",0,0,0,0,0]
[null,null,null,null,null,"Calentador a Gas",null,null,0,"Tecnología solar ",null,null,null,null,0,null,0," En transmilenio",null,0,"Nunca",0,"No dejo restos de alimentos",0,0,0,0,0]
[null,null,null,null,null,"Calentador a Gas",null,null,0,"Tecnología solar ",null,null,null,null,0,null,0," En transmilenio",null,0,"Nunca",0,"No dejo restos de alimentos",0,0,0,0,0]
[null,null,null,null,null,"Calentador a Gas",null,null,0,"Tecnología solar ",null,null,null,null,0,null,0," En transmilenio",null,0,"Nunca",0,"No dejo restos de alimentos",0,0,0,0,0]
[null,null,null,null,null,"Calentador a Gas",null,null,0,"Tecnología solar ",null,null,null,null,0,null,0," En transmilenio",null,0,"Nunca",0,"No dejo restos de alimentos",0,0,0,0,0]
[null,null,null,null,null,"Calentador a Gas",null,null,0,"Tecnología solar ",null,null,null,null,0,null,0," En transmilenio",null,0,"Nunca",0,"No dejo restos de alimentos",0,0,0,0,0]
[null,null,null,null,null,"Calentador a Gas",null,null,0,"Tecnología solar ",null,null,null,null,0,null,0," En transmilenio",null,0,"Nunca",0,"No dejo restos de alimentos",0,0,0,0,0]
[null,null,null,null,null,"Calentador a Gas",null,null,0,"Tecnología solar ",null,null,null,null,0,null,0," En transmilenio",null,0,"Nunca",0,"No dejo restos de alimentos",0,0,0,0,0]
[null,null,null,null,null,"Calentador a Gas",null,null,0,"Tecnología solar ",null,null,null,null,0,null,0," En transmilenio",null,0,"Nunca",{"$f":"IF(U450=\"Nunca\",0,IF(U450=\"3 veces por semana\",\"513\",IF(U450=\"5 veces por semana\",855,IF(U450=\"Todos los días\",1197))))","v":0},"No dejo restos de alimentos",0,0,0,0,0]
[null,null,null,null,null,"Calentador a Gas",null,null,{"$f":"IF(F451=\"Calentador a Gas\",(H451*1.6*1.98*30),IF(F451=\"Calentador Eléctrico\",(H451*1.3*0.199*30),IF(F451=\"Ducha Eléctrica\",(H451*4*0.199*30),IF(F451=\"Ninguno\",\"0\"))))","v":0},"Tecnología solar ",null,null,null,null,{"$f":"IF(J451=\"Ahorradores \",(K451*0.02*5*0.199*30),IF(J451=\"Incandescentes \",(M451*0.1*5*0.199*30),IF(J451=\"LED\",(L451*0.007*5*0.199*30),IF(J451=\"Tecnología solar \",(N451*0)))))","v":0},null,{"$f":"P451*9*0.8312","v":0}," En transmilenio",null,{"$f":"IF(R451=\"En bicicleta\",(0*S451),IF(R451=\"En carro\",(0.218 *S451),IF(R451=\"En bus o SITP \",((0.78703*S451)/40),IF(R451=\" En transmilenio\",((0.68516*S451)/140)))))","v":0},"Nunca",0,"No dejo restos de alimentos",0,{"$f":"V451+T451+Q451+O451+I451+X451","v":0},{"$f":"Y451/1000","v":0},{"$f":"Y451*12","v":0},0]
[null,null,null,null,null,"Calentador a Gas",null,null,0,"Tecnología solar ",null,null,null,null,0,null,0," En transmilenio",null,0,"Nunca",0,"No dejo restos de alimentos",0,0,0,0,0]
[null,null,null,null,null,"Calentador a Gas",null,null,0,"Tecnología solar ",null,null,null,null,0,null,0," En transmilenio",null,0,"Nunca",0,"No dejo restos de alimentos",{"$f":"IF(W453=\"No dejo restos de alimentos\",(0),IF(W453=\"Un cuarto del plato\",(0.25*0.5*0.8312*30),IF(W453=\"La mitad del plato\",(0.5*0.5*0.8312*30),IF(W453=\"Tres cuartos del plato\",(0.75*0.5*0.8312*30)))))","v":0},0,0,0,0]
[null,null,null,null,null,"Calentador a Gas",null,null,0,"Tecnología solar ",null,null,null,null,0,null,0," En transmilenio",null,0,"Nunca",0,"No dejo restos de alimentos",0,0,0,0,0]
[null,null,null,null,null,"Calentador a Gas",null,null,0,"Tecnología solar ",null,null,null,null,0,null,0," En transmilenio",null,0,"Nunca",0,"No dejo restos de alimentos",0,0,0,0,0]
[null,null,null,null,null,"Calentador a Gas",null,null,0,"Tecnología solar ",null,null,null,null,0,null,0," En transmilenio",null,0,"Nunca",0,"No dejo restos de alimentos",0,0,0,0,0]
[null,null,null,null,null,"Calentador a Gas",null,null,0,"Tecnología solar ",null,null,null,null,0,null,0," En transmilenio",null,0,"Nunca",0,"No dejo restos de alimentos",0,0,0,0,0]
[null,null,null,null,null,"Calentador a Gas",null,null,0,"Tecnología solar ",null,null,null,null,0,null,0," En transmilenio",null,0,"Nunca",0,"No dejo restos de alimentos",0,0,0,0,0]
[null,null,null,null,null,"Calentador a Gas",null,null,0,"Tecnología solar ",null,null,null,null,0,null,0," En transmilenio",null,0,"Nunca",0,"No dejo restos de alimentos",0,0,0,0,0]
[null,null,null,null,null,"Calentador a Gas",null,null,0,"Tecnología solar ",null,null,null,null,0,null,0," En transmilenio",null,0,"Nunca",0,"No dejo restos de alimentos",0,0,0,0,0]
[null,null,null,null,null,"Calentador a Gas",null,null,0,"Tecnología solar ",null,null,null,null,0,null,0," En transmilenio",null,0,"Nunca",0,"No dejo restos de alimentos",0,0,0,0,0]
[null,null,null,null,null,"Calentador a Gas",null,null,0,"Tecnología solar ",null,null,null,null,0,null,0," En transmilenio",null,0,"Nunca",0,"No dejo restos de alimentos",0,0,0,0,0]
[null,null,null,null,null,"Calentador a Gas",null,null,0,"Tecnología solar ",null,null,null,null,0,null,0," En transmilenio",null,0,"Nunca",0,"No dejo restos de alimentos",0,0,0,0,0]
[null,null,null,null,null,"Calentador a Gas",null,null,0,"Tecnología solar ",null,null,null,null,0,null,0," En transmilenio",null,0,"Nunca",0,"No dejo restos de alimentos",0,0,0,0,0]
[null,null,null,null,null,"Calentador a Gas",null,null,0,"Tecnología solar ",null,null,null,null,0,null,0," En transmilenio",null,0,"Nunca",0,"No dejo restos de alimentos",0,0,0,0,0]
[null,null,null,null,null,"Calentador a Gas",null,null,0,"Tecnología solar ",null,null,null,null,0,null,0," En transmilenio",null,0,"Nunca",0,"No dejo restos de alimentos",0,0,0,0,0]
[null,null,null,null,null,"Calentador a Gas",null,null,0,"Tecnología solar ",null,null,null,null,0,null,0," En transmilenio",null,0,"Nunca",0,"No dejo restos de alimentos",0,0,0,0,0]
[null,null,null,null,null,"Calentador a Gas",null,null,0,"Tecnología solar ",null,null,null,null,0,null,0," En transmilenio",null,0,"Nunca",0,"No dejo restos de alimentos",0,0,0,0,0]
[null,null,null,null,null,"Calentador a Gas",null,null,0,"Tecnología solar ",null,null,null,null,0,null,0," En transmilenio",null,0,"Nunca",0,"No dejo restos de alimentos",0,0,0,0,0]
[null,null,null,null,null,"Calentador a Gas",null,null,0,"Tecnología solar ",null,null,null,null,0,null,0," En transmilenio",null,0,"Nunca",0,"No dejo restos de alimentos",0,0,0,0,0]
[null,null,null,null,null,"Calentador a Gas",null,null,0,"Tecnología solar ",null,null,null,null,0,null,0," En transmilenio",null,0,"Nunca",0,"No dejo restos de alimentos",0,0,0,0,0]
[null,null,null,null,null,"Calentador a Gas",null,null,0,"Tecnología solar ",null,null,null,null,0,null,0," En transmilenio",null,0,"Nunca",0,"No dejo restos de alimentos",0,0,0,0,0]
[null,null,null,null,null,"Calentador a Gas",null,null,0,"Tecnología solar ",null,null,null,null,0,null,0," En transmilenio",null,0,"Nunca",0,"No dejo restos de alimentos",0,0,0,0,0]
[null,null,null,null,null,"Calentador a Gas",null,null,0,"Tecnología solar ",null,null,null,null,0,null,0," En transmilenio",null,0,"Nunca",0,"No dejo restos de alimentos",0,0,0,0,0]
[null,null,null,null,null,"Calentador a Gas",null,null,0,"Tecnología solar ",null,null,null,null,0,null,0," En transmilenio",null,0,"Nunca",0,"No dejo restos de alimentos",0,0,0,0,0]
[null,null,null,null,null,"Calentador a Gas",null,null,0,"Tecnología solar ",null,null,null,null,0,null,0," En transmilenio",null,0,"Nunca",0,"No dejo restos de alimentos",0,0,0,0,0]
[null,null,null,null,null,"Calentador a Gas",null,null,0,"Tecnología solar ",null,null,null,null,0,null,0," En transmilenio",null,0,"Nunca",0,"No dejo restos de alimentos",0,0,0,0,0]
[null,null,null,null,null,"Calentador a Gas",null,null,0,"Tecnología solar ",null,null,null,null,0,null,0," En transmilenio",null,0,"Nunca",0,"No dejo restos de alimentos",0,0,0,0,0]
[null,null,null,null,null,"Calentador a Gas",null,null,0,"Tecnología solar ",null,null,null,null,0,null,0," En transmilenio",null,0,"Nunca",0,"No dejo restos de alimentos",0,0,0,0,0]
[null,null,null,null,null,"Calentador a Gas",null,null,0,"Tecnología solar ",null,null,null,null,0,null,0," En transmilenio",null,0,"Nunca",0,"No dejo restos de alimentos",0,0,0,0,0]
[null,null,null,null,null,"Calentador a Gas",null,null,0,"Tecnología solar ",null,null,null,null,0,null,0," En transmilenio",null,0,"Nunca",0,"No dejo restos de alimentos",0,0,0,0,0]
[null,null,null,null,null,"Calentador a Gas",null,null,0,"Tecnología solar ",null,null,null,null,0,null,0," En transmilenio",null,0,"Nunca",0,"No dejo restos de alimentos",0,0,0,0,0]
[null,null,null,null,null,"Calentador a Gas",null,null,0,"Tecnología solar ",null,null,null,null,0,null,0," En transmilenio",null,0,"Nunca",0,"No dejo restos de alimentos",0,0,0,0,0]
[null,null,null,null,null,"Calentador a Gas",null,null,0,"Tecnología solar ",null,null,null,null,0,null,0," En transmilenio",null,0,"Nunca",0,"No dejo restos de alimentos",0,0,0,0,0]
[null,null,null,null,null,"Calentador a Gas",null,null,0,"Tecnología solar ",null,null,null,null,0,null,0," En transmilenio",null,0,"Nunca",0,"No dejo restos de alimentos",0,0,0,0,0]
[null,null,null,null,null,"Calentador a Gas",null,null,0,"Tecnología solar ",null,null,null,null,0,null,0," En transmilenio",null,0,"Nunca",0,"No dejo restos de alimentos",0,0,0,0,0]
[null,null,null,null,null,"Calentador a Gas",null,null,0,"Tecnología solar ",null,null,null,null,0,null,0," En transmilenio",null,0,"Nunca",0,"No dejo restos de alimentos",0,0,0,0,0]
[null,null,null,null,null,"Calentador a Gas",null,null,0,"Tecnología solar ",null,null,null,null,0,null,0," En transmilenio",null,0,"Nunca",0,"No dejo restos de alimentos",0,0,0,0,0]
[null,null,null,null,null,"Calentador a Gas",null,null,0,"Tecnología solar ",null,null,null,null,0,null,0," En transmilenio",null,0,"Nunca",0,"No dejo restos de alimentos",0,0,0,0,0]
[null,null,null,null,null,"Calentador a Gas",null,null,0,"Tecnología solar ",null,null,null,null,0,null,0," En transmilenio",null,0,"Nunca",0,"No dejo restos de alimentos",0,0,0,0,0]
[null,null,null,null,null,"Calentador a Gas",null,null,0,"Tecnología solar ",null,null,null,null,0,null,0," En transmilenio",null,0,"Nunca",0,"No dejo restos de alimentos",0,0,0,0,0]
[null,null,null,null,null,"Calentador a Gas",null,null,0,"Tecnología solar ",null,null,null,null,0,null,0," En transmilenio",null,0,"Nunca",0,"No dejo restos de alimentos",0,0,0,0,0]
[null,null,null,null,null,"Calentador a Gas",null,null,0,"Tecnología solar ",null,null,null,null,0,null,0," En transmilenio",null,0,"Nunca",0,"No dejo restos de alimentos",0,0,0,0,0]
[null,null,null,null,null,"Calentador a Gas",null,null,0,"Tecnología solar ",null,null,null,null,0,null,0," En transmilenio",null,0,"Nunca",0,"No dejo restos de alimentos",0,0,0,0,0]
[null,null,null,null,null,"Calentador a Gas",null,null,0,"Tecnología solar ",null,null,null,null,0,null,0," En transmilenio",null,0,"Nunca",0,"No dejo restos de alimentos",0,0,0,0,0]
[null,null,null,null,null,"Calentador a Gas",null,null,0,"Tecnología solar ",null,null,null,null,0,null,0," En transmilenio",null,0,"Nunca",0,"No dejo restos de alimentos",0,0,0,0,0]
[null,null,null,null,null,"Calentador a Gas",null,null,0,"Tecnología solar ",null,null,null,null,0,null,0," En transmilenio",null,0,"Nunca",0,"No dejo restos de alimentos",0,0,0,0,0]
[null,null,null,null,null,"Calentador a Gas",null,null,0,"Tecnología solar ",null,null,null,null,0,null,0," En transmilenio",null,0,"Nunca",0,"No dejo restos de alimentos",0,0,0,0,0]
[null,null,null,null,null,"Calentador a Gas",null,null,0,"Tecnología solar ",null,null,null,null,0,null,0," En transmilenio",null,0,"Nunca",0,"No dejo restos de alimentos",0,0,0,0,0]
[null,null,null,null,null,"Calentador a Gas",null,null,0,"Tecnología solar ",null,null,null,null,0,null,0," En transmilenio",null,0,"Nunca",0,"No dejo restos de alimentos",0,0,0,0,0]
[null,null,null,null,null,"Calentador a Gas",null,null,0,"Tecnología solar ",null,null,null,null,0,null,0," En transmilenio",null,0,"Nunca",0,"No dejo restos de alimentos",0,0,0,0,0]
[null,null,null,null,null,"Calentador a Gas",null,null,0,"Tecnología solar ",null,null,null,null,0,null,0," En transmilenio",null,0,"Nunca",0,"No dejo restos de alimentos",0,0,0,0,0]
[null,null,null,null,null,"Calentador a Gas",null,null,0,"Tecnología solar ",null,null,null,null,0,null,0," En transmilenio",null,0,"Nunca",0,"No dejo restos de alimentos",0,0,0,0,0]
[null,null,null,null,null,"Calentador a Gas",null,null,0,"Tecnología solar ",null,null,null,null,0,null,0," En transmilenio",null,0,"Nunca",0,"No dejo restos de alimentos",0,0,0,0,0]
[null,null,null,null,null,"Calentador a Gas",null,null,0,"Tecnología solar ",null,null,null,null,0,null,0," En transmilenio",null,0,"Nunca",0,"No dejo restos de alimentos",0,0,0,0,0]
[null,null,null,null,null,"Calentador a Gas",null,null,0,"Tecnología solar ",null,null,null,null,0,null,0," En transmilenio",null,0,"Nunca",0,"No dejo restos de alimentos",0,0,0,0,0]
[null,null,null,null,null,"Calentador a Gas",null,null,0,"Tecnología solar ",null,null,null,null,0,null,0," En transmilenio",null,0,"Nunca",0,"No dejo restos de alimentos",0,0,0,0,0]
[null,null,null,null,null,"Calentador a Gas",null,null,0,"Tecnología solar ",null,null,null,null,0,null,0," En transmilenio",null,0,"Nunca",0,"No dejo restos de alimentos",0,0,0,0,0]
[null,null,null,null,null,"Calentador a Gas",null,null,0,"Tecnología solar ",null,null,null,null,0,null,0," En transmilenio",null,0,"Nunca",0,"No dejo restos de alimentos",0,0,0,0,0]
[null,null,null,null,null,"Calentador a Gas",null,null,0,"Tecnología solar ",null,null,null,null,0,null,0," En transmilenio",null,0,"Nunca",0,"No dejo restos de alimentos",0,0,0,0,0]
[null,null,null,null,null,"Calentador a Gas",null,null,0,"Tecnología solar ",null,null,null,null,0,null,0," En transmilenio",null,0,"Nunca",0,"No dejo restos de alimentos",0,0,0,0,0]
[null,null,null,null,null,"Calentador a Gas",null,null,0,"Tecnología solar ",null,null,null,null,0,null,0," En transmilenio",null,0,"Nunca",0,"No dejo restos de alimentos",0,0,0,0,0]
[null,null,null,null,null,"Calentador a Gas",null,null,0,"Tecnología solar ",null,null,null,null,0,null,0," En transmilenio",null,0,"Nunca",0,"No dejo restos de alimentos",0,0,0,0,0]
[null,null,null,null,null,"Calentador a Gas",null,null,0,"Tecnología solar ",null,null,null,null,0,null,0," En transmilenio",null,0,"Nunca",{"$f":"IF(U514=\"Nunca\",0,IF(U514=\"3 veces por semana\",\"513\",IF(U514=\"5 veces por semana\",855,IF(U514=\"Todos los días\",1197))))","v":0},"No dejo restos de alimentos",0,0,0,0,0]
[null,null,null,null,null,"Calentador a Gas",null,null,{"$f":"IF(F515=\"Calentador a Gas\",(H515*1.6*1.98*30),IF(F515=\"Calentador Eléctrico\",(H515*1.3*0.199*30),IF(F515=\"Ducha Eléctrica\",(H515*4*0.199*30),IF(F515=\"Ninguno\",\"0\"))))","v":0},"Tecnología solar ",null,null,null,null,{"$f":"IF(J515=\"Ahorradores \",(K515*0.02*5*0.199*30),IF(J515=\"Incandescentes \",(M515*0.1*5*0.199*30),IF(J515=\"LED\",(L515*0.007*5*0.199*30),IF(J515=\"Tecnología solar \",(N515*0)))))","v":0},null,{"$f":"P515*9*0.8312","v":0}," En transmilenio",null,{"$f":"IF(R515=\"En bicicleta\",(0*S515),IF(R515=\"En carro\",(0.218 *S515),IF(R515=\"En bus o SITP \",((0.78703*S515)/40),IF(R515=\" En transmilenio\",((0.68516*S515)/140)))))","v":0},"Nunca",0,"No dejo restos de alimentos",0,{"$f":"V515+T515+Q515+O515+I515+X515","v":0},{"$f":"Y515/1000","v":0},{"$f":"Y515*12","v":0},0]
[null,null,null,null,null,"Calentador a Gas",null,null,0,"Tecnología solar ",null,null,null,null,0,null,0," En transmilenio",null,0,"Nunca",0,"No dejo restos de alimentos",0,0,0,0,0]
[null,null,null,null,null,"Calentador a Gas",null,null,0,"Tecnología solar ",null,null,null,null,0,null,0," En transmilenio",null,0,"Nunca",0,"No dejo restos de alimentos",{"$f":"IF(W517=\"No dejo restos de alimentos\",(0),IF(W517=\"Un cuarto del plato\",(0.25*0.5*0.8312*30),IF(W517=\"La mitad del plato\",(0.5*0.5*0.8312*30),IF(W517=\"Tres cuartos del plato\",(0.75*0.5*0.8312*30)))))","v":0},0,0,0,0]
[null,null,null,null,null,"Calentador a Gas",null,null,0,"Tecnología solar ",null,null,null,null,0,null,0," En transmilenio",null,0,"Nunca",0,"No dejo restos de alimentos",0,0,0,0,0]
[null,null,null,null,null,"Calentador a Gas",null,null,0,"Tecnología solar ",null,null,null,null,0,null,0," En transmilenio",null,0,"Nunca",0,"No dejo restos de alimentos",0,0,0,0,0]
[null,null,null,null,null,"Calentador a Gas",null,null,0,"Tecnología solar ",null,null,null,null,0,null,0," En transmilenio",null,0,"Nunca",0,"No dejo restos de alimentos",0,0,0,0,0]
[null,null,null,null,null,"Calentador a Gas",null,null,0,"Tecnología solar ",null,null,null,null,0,null,0," En transmilenio",null,0,"Nunca",0,"No dejo restos de alimentos",0,0,0,0,0]
[null,null,null,null,null,"Calentador a Gas",null,null,0,"Tecnología solar ",null,null,null,null,0,null,0," En transmilenio",null,0,"Nunca",0,"No dejo restos de alimentos",0,0,0,0,0]
[null,null,null,null,null,"Calentador a Gas",null,null,0,"Tecnología solar ",null,null,null,null,0,null,0," En transmilenio",null,0,"Nunca",0,"No dejo restos de alimentos",0,0,0,0,0]
[null,null,null,null,null,"Calentador a Gas",null,null,0,"Tecnología solar ",null,null,null,null,0,null,0," En transmilenio",null,0,"Nunca",0,"No dejo restos de alimentos",0,0,0,0,0]
[null,null,null,null,null,"Calentador a Gas",null,null,0,"Tecnología solar ",null,null,null,null,0,null,0," En transmilenio",null,0,"Nunca",0,"No dejo restos de alimentos",0,0,0,0,0]
[null,null,null,null,null,"Calentador a Gas",null,null,0,"Tecnología solar ",null,null,null,null,0,null,0," En transmilenio",null,0,"Nunca",0,"No dejo restos de alimentos",0,0,0,0,0]
[null,null,null,null,null,"Calentador a Gas",null,null,0,"Tecnología solar ",null,null,null,null,0,null,0," En transmilenio",null,0,"Nunca",0,"No dejo restos de alimentos",0,0,0,0,0]
[null,null,null,null,null,"Calentador a Gas",null,null,0,"Tecnología solar ",null,null,null,null,0,null,0," En transmilenio",null,0,"Nunca",0,"No dejo restos de alimentos",0,0,0,0,0]
[null,null,null,null,null,"Calentador a Gas",null,null,0,"Tecnología solar ",null,null,null,null,0,null,0," En transmilenio",null,0,"Nunca",0,"No dejo restos de alimentos",0,0,0,0,0]
[null,null,null,null,null,"Calentador a Gas",null,null,0,"Tecnología solar ",null,null,null,null,0,null,0," En transmilenio",null,0,"Nunca",0,"No dejo restos de alimentos",0,0,0,0,0]
[null,null,null,null,null,"Calentador a Gas",null,null,0,"Tecnología solar ",null,null,null,null,0,null,0," En transmilenio",null,0,"Nunca",0,"No dejo restos de alimentos",0,0,0,0,0]
[null,null,null,null,null,"Calentador a Gas",null,null,0,"Tecnología solar ",null,null,null,null,0,null,0," En transmilenio",null,0,"Nunca",0,"No dejo restos de alimentos",0,0,0,0,0]
[null,null,null,null,null,"Calentador a Gas",null,null,0,"Tecnología solar ",null,null,null,null,0,null,0," En transmilenio",null,0,"Nunca",0,"No dejo restos de alimentos",0,0,0,0,0]
[null,null,null,null,null,"Calentador a Gas",null,null,0,"Tecnología solar ",null,null,null,null,0,null,0," En transmilenio",null,0,"Nunca",0,"No dejo restos de alimentos",0,0,0,0,0]
[null,null,null,null,null,"Calentador a Gas",null,null,0,"Tecnología solar ",null,null,null,null,0,null,0," En transmilenio",null,0,"Nunca",0,"No dejo restos de alimentos",0,0,0,0,0]
[null,null,null,null,null,"Calentador a Gas",null,null,0,"Tecnología solar ",null,null,null,null,0,null,0," En transmilenio",null,0,"Nunca",0,"No dejo restos de alimentos",0,0,0,0,0]
[null,null,null,null,null,"Calentador a Gas",null,null,0,"Tecnología solar ",null,null,null,null,0,null,0," En transmilenio",null,0,"Nunca",0,"No dejo restos de alimentos",0,0,0,0,0]
[null,null,null,null,null,"Calentador a Gas",null,null,0,"Tecnología solar ",null,null,null,null,0,null,0," En transmilenio",null,0,"Nunca",0,"No dejo restos de alimentos",0,0,0,0,0]
[null,null,null,null,null,"Calentador a Gas",null,null,0,"Tecnología solar ",null,null,null,null,0,null,0," En transmilenio",null,0,"Nunca",0,"No dejo restos de alimentos",0,0,0,0,0]
[null,null,null,null,null,"Calentador a Gas",null,null,0,"Tecnología solar ",null,null,null,null,0,null,0," En transmilenio",null,0,"Nunca",0,"No dejo restos de alimentos",0,0,0,0,0]
[null,null,null,null,null,"Calentador a Gas",null,null,0,"Tecnología solar ",null,null,null,null,0,null,0," En transmilenio",null,0,"Nunca",0,"No dejo restos de alimentos",0,0,0,0,0]
[null,null,null,null,null,"Calentador a Gas",null,null,0,"Tecnología solar ",null,null,null,null,0,null,0," En transmilenio",null,0,"Nunca",0,"No dejo restos de alimentos",0,0,0,0,0]
[null,null,null,null,null,"Calentador a Gas",null,null,0,"Tecnología solar ",null,null,null,null,0,null,0," En transmilenio",null,0,"Nunca",0,"No dejo restos de alimentos",0,0,0,0,0]
[null,null,null,null,null,"Calentador a Gas",null,null,0,"Tecnología solar ",null,null,null,null,0,null,0," En transmilenio",null,0,"Nunca",0,"No dejo restos de alimentos",0,0,0,0,0]
[null,null,null,null,null,"Calentador a Gas",null,null,0,"Tecnología solar ",null,null,null,null,0,null,0," En transmilenio",null,0,"Nunca",0,"No dejo restos de alimentos",0,0,0,0,0]
[null,null,null,null,null,"Calentador a Gas",null,null,0,"Tecnología solar ",null,null,null,null,0,null,0," En transmilenio",null,0,"Nunca",0,"No dejo restos de alimentos",0,0,0,0,0]
[null,null,null,null,null,"Calentador a Gas",null,null,0,"Tecnología solar ",null,null,null,null,0,null,0," En transmilenio",null,0,"Nunca",0,"No dejo restos de alimentos",0,0,0,0,0]
[null,null,null,null,null,"Calentador a Gas",null,null,0,"Tecnología solar ",null,null,null,null,0,null,0," En transmilenio",null,0,"Nunca",0,"No dejo restos de alimentos",0,0,0,0,0]
[null,null,null,null,null,"Calentador a Gas",null,null,0,"Tecnología solar ",null,null,null,null,0,null,0," En transmilenio",null,0,"Nunca",0,"No dejo restos de alimentos",0,0,0,0,0]
[null,null,null,null,null,"Calentador a Gas",null,null,0,"Tecnología solar ",null,null,null,null,0,null,0," En transmilenio",null,0,"Nunca",0,"No dejo restos de alimentos",0,0,0,0,0]
[null,null,null,null,null,"Calentador a Gas",null,null,0,"Tecnología solar ",null,null,null,null,0,null,0," En transmilenio",null,0,"Nunca",0,"No dejo restos de alimentos",0,0,0,0,0]
[null,null,null,null,null,"Calentador a Gas",null,null,0,"Tecnología solar ",null,null,null,null,0,null,0," En transmilenio",null,0,"Nunca",0,"No dejo restos de alimentos",0,0,0,0,0]
[null,null,null,null,null,"Calentador a Gas",null,null,0,"Tecnología solar ",null,null,null,null,0,null,0," En transmilenio",null,0,"Nunca",0,"No dejo restos de alimentos",0,0,0,0,0]
[null,null,null,null,null,"Calentador a Gas",null,null,0,"Tecnología solar ",null,null,null,null,0,null,0," En transmilenio",null,0,"Nunca",0,"No dejo restos de alimentos",0,0,0,0,0]
[null,null,null,null,null,"Calentador a Gas",null,null,0,"Tecnología solar ",null,null,null,null,0,null,0," En transmilenio",null,0,"Nunca",0,"No dejo restos de alimentos",0,0,0,0,0]
[null,null,null,null,null,"Calentador a Gas",null,null,0,"Tecnología solar ",null,null,null,null,0,null,0," En transmilenio",null,0,"Nunca",0,"No dejo restos de alimentos",0,0,0,0,0]
[null,null,null,null,null,"Calentador a Gas",null,null,0,"Tecnología solar ",null,null,null,null,0,null,0," En transmilenio",null,0,"Nunca",0,"No dejo restos de alimentos",0,0,0,0,0]
[null,null,null,null,null,"Calentador a Gas",null,null,0,"Tecnología solar ",null,null,null,null,0,null,0," En transmilenio",null,0,"Nunca",0,"No dejo restos de alimentos",0,0,0,0,0]
[null,null,null,null,null,"Calentador a Gas",null,null,0,"Tecnología solar ",null,null,null,null,0,null,0," En transmilenio",null,0,"Nunca",0,"No dejo restos de alimentos",0,0,0,0,0]
[null,null,null,null,null,"Calentador a Gas",null,null,0,"Tecnología solar ",null,null,null,null,0,null,0," En transmilenio",null,0,"Nunca",0,"No dejo restos de alimentos",0,0,0,0,0]
[null,null,null,null,null,"Calentador a Gas",null,null,0,"Tecnología solar ",null,null,null,null,0,null,0," En transmilenio",null,0,"Nunca",0,"No dejo restos de alimentos",0,0,0,0,0]
[null,null,null,null,null,"Calentador a Gas",null,null,0,"Tecnología solar ",null,null,null,null,0,null,0," En transmilenio",null,0,"Nunca",0,"No dejo restos de alimentos",0,0,0,0,0]
[null,null,null,null,null,"Calentador a Gas",null,null,0,"Tecnología solar ",null,null,null,null,0,null,0," En transmilenio",null,0,"Nunca",0,"No dejo restos de alimentos",0,0,0,0,0]
[null,null,null,null,null,"Calentador a Gas",null,null,0,"Tecnología solar ",null,null,null,null,0,null,0," En transmilenio",null,0,"Nunca",0,"No dejo restos de alimentos",0,0,0,0,0]
[null,null,null,null,null,"Calentador a Gas",null,null,0,"Tecnología solar ",null,null,null,null,0,null,0," En transmilenio",null,0,"Nunca",0,"No dejo restos de alimentos",0,0,0,0,0]
[null,null,null,null,null,"Calentador a Gas",null,null,0,"Tecnología solar ",null,null,null,null,0,null,0," En transmilenio",null,0,"Nunca",0,"No dejo restos de alimentos",0,0,0,0,0]
[null,null,null,null,null,"Calentador a Gas",null,null,0,"Tecnología solar ",null,null,null,null,0,null,0," En transmilenio",null,0,"Nunca",0,"No dejo restos de alimentos",0,0,0,0,0]
[null,null,null,null,null,"Calentador a Gas",null,null,0,"Tecnología solar ",null,null,null,null,0,null,0," En transmilenio",null,0,"Nunca",0,"No dejo restos de alimentos",0,0,0,0,0]
[null,null,null,null,null,"Calentador a Gas",null,null,0,"Tecnología solar ",null,null,null,null,0,null,0," En transmilenio",null,0,"Nunca",0,"No dejo restos de alimentos",0,0,0,0,0]
[null,null,null,null,null,"Calentador a Gas",null,null,0,"Tecnología solar ",null,null,null,null,0,null,0," En transmilenio",null,0,"Nunca",0,"No dejo restos de alimentos",0,0,0,0,0]
[null,null,null,null,null,"Calentador a Gas",null,null,0,"Tecnología solar ",null,null,null,null,0,null,0," En transmilenio",null,0,"Nunca",0,"No dejo restos de alimentos",0,0,0,0,0]
[null,null,null,null,null,"Calentador a Gas",null,null,0,"Tecnología solar ",null,null,null,null,0,null,0," En transmilenio",null,0,"Nunca",0,"No dejo restos de alimentos",0,0,0,0,0]
[null,null,null,null,null,"Calentador a Gas",null,null,0,"Tecnología solar ",null,null,null,null,0,null,0," En transmilenio",null,0,"Nunca",0,"No dejo restos de alimentos",0,0,0,0,0]
[null,null,null,null,null,"Calentador a Gas",null,null,0,"Tecnología solar ",null,null,null,null,0,null,0," En transmilenio",null,0,"Nunca",0,"No dejo restos de alimentos",0,0,0,0,0]
[null,null,null,null,null,"Calentador a Gas",null,null,0,"Tecnología solar ",null,null,null,null,0,null,0," En transmilenio",null,0,"Nunca",0,"No dejo restos de alimentos",0,0,0,0,0]
[null,null,null,null,null,"Calentador a Gas",null,null,0,"Tecnología solar ",null,null,null,null,0,null,0," En transmilenio",null,0,"Nunca",0,"No dejo restos de alimentos",0,0,0,0,0]
[null,null,null,null,null,"Calentador a Gas",null,null,0,"Tecnología solar ",null,null,null,null,0,null,0," En transmilenio",null,0,"Nunca",0,"No dejo restos de alimentos",0,0,0,0,0]
[null,null,null,null,null,"Calentador a Gas",null,null,0,"Tecnología solar ",null,null,null,null,0,null,0," En transmilenio",null,0,"Nunca",{"$f":"IF(U578=\"Nunca\",0,IF(U578=\"3 veces por semana\",\"513\",IF(U578=\"5 veces por semana\",855,IF(U578=\"Todos los días\",1197))))","v":0},"No dejo restos de alimentos",0,0,0,0,0]
[null,null,null,null,null,"Calentador a Gas",null,null,{"$f":"IF(F579=\"Calentador a Gas\",(H579*1.6*1.98*30),IF(F579=\"Calentador Eléctrico\",(H579*1.3*0.199*30),IF(F579=\"Ducha Eléctrica\",(H579*4*0.199*30),IF(F579=\"Ninguno\",\"0\"))))","v":0},"Tecnología solar ",null,null,null,null,{"$f":"IF(J579=\"Ahorradores \",(K579*0.02*5*0.199*30),IF(J579=\"Incandescentes \",(M579*0.1*5*0.199*30),IF(J579=\"LED\",(L579*0.007*5*0.199*30),IF(J579=\"Tecnología solar \",(N579*0)))))","v":0},null,{"$f":"P579*9*0.8312","v":0}," En transmilenio",null,{"$f":"IF(R579=\"En bicicleta\",(0*S579),IF(R579=\"En carro\",(0.218 *S579),IF(R579=\"En bus o SITP \",((0.78703*S579)/40),IF(R579=\" En transmilenio\",((0.68516*S579)/140)))))","v":0},"Nunca",0,"No dejo restos de alimentos",0,{"$f":"V579+T579+Q579+O579+I579+X579","v":0},{"$f":"Y579/1000","v":0},{"$f":"Y579*12","v":0},0]
[null,null,null,null,null,"Calentador a Gas",null,null,0,"Tecnología solar ",null,null,null,null,0,null,0," En transmilenio",null,0,"Nunca",0,"No dejo restos de alimentos",0,0,0,0,0]
[null,null,null,null,null,"Calentador a Gas",null,null,0,"Tecnología solar ",null,null,null,null,0,null,0," En transmilenio",null,0,"Nunca",0,"No dejo restos de alimentos",{"$f":"IF(W581=\"No dejo restos de alimentos\",(0),IF(W581=\"Un cuarto del plato\",(0.25*0.5*0.8312*30),IF(W581=\"La mitad del plato\",(0.5*0.5*0.8312*30),IF(W581=\"Tres cuartos del plato\",(0.75*0.5*0.8312*30)))))","v":0},0,0,0,0]
[null,null,null,null,null,"Calentador a Gas",null,null,0,"Tecnología solar ",null,null,null,null,0,null,0," En transmilenio",null,0,"Nunca",0,"No dejo restos de alimentos",0,0,0,0,0]
[null,null,null,null,null,"Calentador a Gas",null,null,0,"Tecnología solar ",null,null,null,null,0,null,0," En transmilenio",null,0,"Nunca",0,"No dejo restos de alimentos",0,0,0,0,0]
[null,null,null,null,null,"Calentador a Gas",null,null,0,"Tecnología solar ",null,null,null,null,0,null,0," En transmilenio",null,0,"Nunca",0,"No dejo restos de alimentos",0,0,0,0,0]
[null,null,null,null,null,"Calentador a Gas",null,null,0,"Tecnología solar ",null,null,null,null,0,null,0," En transmilenio",null,0,"Nunca",0,"No dejo restos de alimentos",0,0,0,0,0]
[null,null,null,null,null,"Calentador a Gas",null,null,0,"Tecnología solar ",null,null,null,null,0,null,0," En transmilenio",null,0,"Nunca",0,"No dejo restos de alimentos",0,0,0,0,0]
[null,null,null,null,null,"Calentador a Gas",null,null,0,"Tecnología solar ",null,null,null,null,0,null,0," En transmilenio",null,0,"Nunca",0,"No dejo restos de alimentos",0,0,0,0,0]
[null,null,null,null,null,"Calentador a Gas",null,null,0,"Tecnología solar ",null,null,null,null,0,null,0," En transmilenio",null,0,"Nunca",0,"No dejo restos de alimentos",0,0,0,0,0]
[null,null,null,null,null,"Calentador a Gas",null,null,0,"Tecnología solar ",null,null,null,null,0,null,0," En transmilenio",null,0,"Nunca",0,"No dejo restos de alimentos",0,0,0,0,0]
[null,null,null,null,null,"Calentador a Gas",null,null,0,"Tecnología solar ",null,null,null,null,0,null,0," En transmilenio",null,0,"Nunca",0,"No dejo restos de alimentos",0,0,0,0,0]
[null,null,null,null,null,"Calentador a Gas",null,null,0,"Tecnología solar ",null,null,null,null,0,null,0," En transmilenio",null,0,"Nunca",0,"No dejo restos de alimentos",0,0,0,0,0]
[null,null,null,null,null,"Calentador a Gas",null,null,0,"Tecnología solar ",null,null,null,null,0,null,0," En transmilenio",null,0,"Nunca",0,"No dejo restos de alimentos",0,0,0,0,0]
[null,null,null,null,null,"Calentador a Gas",null,null,0,"Tecnología solar ",null,null,null,null,0,null,0," En transmilenio",null,0,"Nunca",0,"No dejo restos de alimentos",0,0,0,0,0]
[null,null,null,null,null,"Calentador a Gas",null,null,0,"Tecnología solar ",null,null,null,null,0,null,0," En transmilenio",null,0,"Nunca",0,"No dejo restos de alimentos",0,0,0,0,0]
[null,null,null,null,null,"Calentador a Gas",null,null,0,"Tecnología solar ",null,null,null,null,0,null,0," En transmilenio",null,0,"Nunca",0,"No dejo restos de alimentos",0,0,0,0,0]
[null,null,null,null,null,"Calentador a Gas",null,null,0,"Tecnología solar ",null,null,null,null,0,null,0," En transmilenio",null,0,"Nunca",0,"No dejo restos de alimentos",0,0,0,0,0]
[null,null,null,null,null,"Calentador a Gas",null,null,0,"Tecnología solar ",null,null,null,null,0,null,0," En transmilenio",null,0,"Nunca",0,"No dejo restos de alimentos",0,0,0,0,0]
[null,null,null,null,null,"Calentador a Gas",null,null,0,"Tecnología solar ",null,null,null,null,0,null,0," En transmilenio",null,0,"Nunca",0,"No dejo restos de alimentos",0,0,0,0,0]
[null,null,null,null,null,"Calentador a Gas",null,null,0,"Tecnología solar ",null,null,null,null,0,null,0," En transmilenio",null,0,"Nunca",0,"No dejo restos de alimentos",0,0,0,0,0]
[null,null,null,null,null,"Calentador a Gas",null,null,0,"Tecnología solar ",null,null,null,null,0,null,0," En transmilenio",null,0,"Nunca",0,"No dejo restos de alimentos",0,0,0,0,0]
[null,null,null,null,null,"Calentador a Gas",null,null,0,"Tecnología solar ",null,null,null,null,0,null,0," En transmilenio",null,0,"Nunca",0,"No dejo restos de alimentos",0,0,0,0,0]
[null,null,null,null,null,"Calentador a Gas",null,null,0,"Tecnología solar ",null,null,null,null,0,null,0," En transmilenio",null,0,"Nunca",0,"No dejo restos de alimentos",0,0,0,0,0]
[null,null,null,null,null,"Calentador a Gas",null,null,0,"Tecnología solar ",null,null,null,null,0,null,0," En transmilenio",null,0,"Nunca",0,"No dejo restos de alimentos",0,0,0,0,0]
[null,null,null,null,null,"Calentador a Gas",null,null,0,"Tecnología solar ",null,null,null,null,0,null,0," En transmilenio",null,0,"Nunca",0,"No dejo restos de alimentos",0,0,0,0,0]
[null,null,null,null,null,"Calentador a Gas",null,null,0,"Tecnología solar ",null,null,null,null,0,null,0," En transmilenio",null,0,"Nunca",0,"No dejo restos de alimentos",0,0,0,0,0]
[null,null,null,null,null,"Calentador a Gas",null,null,0,"Tecnología solar ",null,null,null,null,0,null,0," En transmilenio",null,0,"Nunca",0,"No dejo restos de alimentos",0,0,0,0,0]
[null,null,null,null,null,"Calentador a Gas",null,null,0,"Tecnología solar ",null,null,null,null,0,null,0," En transmilenio",null,0,"Nunca",0,"No dejo restos de alimentos",0,0,0,0,0]
[null,null,null,null,null,"Calentador a Gas",null,null,0,"Tecnología solar ",null,null,null,null,0,null,0," En transmilenio",null,0,"Nunca",0,"No dejo restos de alimentos",0,0,0,0,0]
[null,null,null,null,null,"Calentador a Gas",null,null,0,"Tecnología solar ",null,null,null,null,0,null,0," En transmilenio",null,0,"Nunca",0,"No dejo restos de alimentos",0,0,0,0,0]
[null,null,null,null,null,"Calentador a Gas",null,null,0,"Tecnología solar ",null,null,null,null,0,null,0," En transmilenio",null,0,"Nunca",0,"No dejo restos de alimentos",0,0,0,0,0]
[null,null,null,null,null,"Calentador a Gas",null,null,0,"Tecnología solar ",null,null,null,null,0,null,0," En transmilenio",null,0,"Nunca",0,"No dejo restos de alimentos",0,0,0,0,0]
[null,null,null,null,null,"Calentador a Gas",null,null,0,"Tecnología solar ",null,null,null,null,0,null,0," En transmilenio",null,0,"Nunca",0,"No dejo restos de alimentos",0,0,0,0,0]
[null,null,null,null,null,"Calentador a Gas",null,null,0,"Tecnología solar ",null,null,null,null,0,null,0," En transmilenio",null,0,"Nunca",0,"No dejo restos de alimentos",0,0,0,0,0]
[null,null,null,null,null,"Calentador a Gas",null,null,0,"Tecnología solar ",null,null,null,null,0,null,0," En transmilenio",null,0,"Nunca",0,"No dejo restos de alimentos",0,0,0,0,0]
[null,null,null,null,null,"Calentador a Gas",null,null,0,"Tecnología solar ",null,null,null,null,0,null,0," En transmilenio",null,0,"Nunca",0,"No dejo restos de alimentos",0,0,0,0,0]
[null,null,null,null,null,"Calentador a Gas",null,null,0,"Tecnología solar ",null,null,null,null,0,null,0," En transmilenio",null,0,"Nunca",0,"No dejo restos de alimentos",0,0,0,0,0]
[null,null,null,null,null,"Calentador a Gas",null,null,0,"Tecnología solar ",null,null,null,null,0,null,0," En transmilenio",null,0,"Nunca",0,"No dejo restos de alimentos",0,0,0,0,0]
[null,null,null,null,null,"Calentador a Gas",null,null,0,"Tecnología solar ",null,null,null,null,0,null,0," En transmilenio",null,0,"Nunca",0,"No dejo restos de alimentos",0,0,0,0,0]
[null,null,null,null,null,"Calentador a Gas",null,null,0,"Tecnología solar ",null,null,null,null,0,null,0," En transmilenio",null,0,"Nunca",0,"No dejo restos de alimentos",0,0,0,0,0]
[null,null,null,null,null,"Calentador a Gas",null,null,0,"Tecnología solar ",null,null,null,null,0,null,0," En transmilenio",null,0,"Nunca",0,"No dejo restos de alimentos",0,0,0,0,0]
[null,null,null,null,null,"Calentador a Gas",null,null,0,"Tecnología solar ",null,null,null,null,0,null,0," En transmilenio",null,0,"Nunca",0,"No dejo restos de alimentos",0,0,0,0,0]
[null,null,null,null,null,"Calentador a Gas",null,null,0,"Tecnología solar ",null,null,null,null,0,null,0," En transmilenio",null,0,"Nunca",0,"No dejo restos de alimentos",0,0,0,0,0]
[null,null,null,null,null,"Calentador a Gas",null,null,0,"Tecnología solar ",null,null,null,null,0,null,0," En transmilenio",null,0,"Nunca",0,"No dejo restos de alimentos",0,0,0,0,0]
[null,null,null,null,null,"Calentador a Gas",null,null,0,"Tecnología solar ",null,null,null,null,0,null,0," En transmilenio",null,0,"Nunca",0,"No dejo restos de alimentos",0,0,0,0,0]
[null,null,null,null,null,"Calentador a Gas",null,null,0,"Tecnología solar ",null,null,null,null,0,null,0," En transmilenio",null,0,"Nunca",0,"No dejo restos de alimentos",0,0,0,0,0]
[null,null,null,null,null,"Calentador a Gas",null,null,0,"Tecnología solar ",null,null,null,null,0,null,0," En transmilenio",null,0,"Nunca",0,"No dejo restos de alimentos",0,0,0,0,0]
[null,null,null,null,null,"Calentador a Gas",null,null,0,"Tecnología solar ",null,null,null,null,0,null,0," En transmilenio",null,0,"Nunca",0,"No dejo restos de alimentos",0,0,0,0,0]
[null,null,null,null,null,"Calentador a Gas",null,null,0,"Tecnología solar ",null,null,null,null,0,null,0," En transmilenio",null,0,"Nunca",0,"No dejo restos de alimentos",0,0,0,0,0]
[null,null,null,null,null,"Calentador a Gas",null,null,0,"Tecnología solar ",null,null,null,null,0,null,0," En transmilenio",null,0,"Nunca",0,"No dejo restos de alimentos",0,0,0,0,0]
[null,null,null,null,null,"Calentador a Gas",null,null,0,"Tecnología solar ",null,null,null,null,0,null,0," En transmilenio",null,0,"Nunca",0,"No dejo restos de alimentos",0,0,0,0,0]
[null,null,null,null,null,"Calentador a Gas",null,null,0,"Tecnología solar ",null,null,null,null,0,null,0," En transmilenio",null,0,"Nunca",0,"No dejo restos de alimentos",0,0,0,0,0]
[null,null,null,null,null,"Calentador a Gas",null,null,0,"Tecnología solar ",null,null,null,null,0,null,0," En transmilenio",null,0,"Nunca",0,"No dejo restos de alimentos",0,0,0,0,0]
[null,null,null,null,null,"Calentador a Gas",null,null,0,"Tecnología solar ",null,null,null,null,0,null,0," En transmilenio",null,0,"Nunca",0,"No dejo restos de alimentos",0,0,0,0,0]
[null,null,null,null,null,"Calentador a Gas",null,null,0,"Tecnología solar ",null,null,null,null,0,null,0," En transmilenio",null,0,"Nunca",0,"No dejo restos de alimentos",0,0,0,0,0]
[null,null,null,null,null,"Calentador a Gas",null,null,0,"Tecnología solar ",null,null,null,null,0,null,0," En transmilenio",null,0,"Nunca",0,"No dejo restos de alimentos",0,0,0,0,0]
[null,null,null,null,null,"Calentador a Gas",null,null,0,"Tecnología solar ",null,null,null,null,0,null,0," En transmilenio",null,0,"Nunca",0,"No dejo restos de alimentos",0,0,0,0,0]
[null,null,null,null,null,"Calentador a Gas",null,null,0,"Tecnología solar ",null,null,null,null,0,null,0," En transmilenio",null,0,"Nunca",0,"No dejo restos de alimentos",0,0,0,0,0]
[null,null,null,null,null,"Calentador a Gas",null,null,0,"Tecnología solar ",null,null,null,null,0,null,0," En transmilenio",null,0,"Nunca",0,"No dejo restos de alimentos",0,0,0,0,0]
[null,null,null,null,null,"Calentador a Gas",null,null,0,"Tecnología solar ",null,null,null,null,0,null,0," En transmilenio",null,0,"Nunca",0,"No dejo restos de alimentos",0,0,0,0,0]
[null,null,null,null,null,"Calentador a Gas",null,null,0,"Tecnología solar ",null,null,null,null,0,null,0," En transmilenio",null,0,"Nunca",0,"No dejo restos de alimentos",0,0,0,0,0]
[null,null,null,null,null,"Calentador a Gas",null,null,0,"Tecnología solar ",null,null,null,null,0,null,0," En transmilenio",null,0,"Nunca",0,"No dejo restos de alimentos",0,0,0,0,0]
[null,null,null,null,null,"Calentador a Gas",null,null,0,"Tecnología solar ",null,null,null,null,0,null,0," En transmilenio",null,0,"Nunca",{"$f":"IF(U642=\"Nunca\",0,IF(U642=\"3 veces por semana\",\"513\",IF(U642=\"5 veces por semana\",855,IF(U642=\"Todos los días\",1197))))","v":0},"No dejo restos de alimentos",0,0,0,0,0]
[null,null,null,null,null,"Calentador a Gas",null,null,{"$f":"IF(F643=\"Calentador a Gas\",(H643*1.6*1.98*30),IF(F643=\"Calentador Eléctrico\",(H643*1.3*0.199*30),IF(F643=\"Ducha Eléctrica\",(H643*4*0.199*30),IF(F643=\"Ninguno\",\"0\"))))","v":0},"Tecnología solar ",null,null,null,null,{"$f":"IF(J643=\"Ahorradores \",(K643*0.02*5*0.199*30),IF(J643=\"Incandescentes \",(M643*0.1*5*0.199*30),IF(J643=\"LED\",(L643*0.007*5*0.199*30),IF(J643=\"Tecnología solar \",(N643*0)))))","v":0},null,{"$f":"P643*9*0.8312","v":0}," En transmilenio",null,{"$f":"IF(R643=\"En bicicleta\",(0*S643),IF(R643=\"En carro\",(0.218 *S643),IF(R643=\"En bus o SITP \",((0.78703*S643)/40),IF(R643=\" En transmilenio\",((0.68516*S643)/140)))))","v":0},"Nunca",0,"No dejo restos de alimentos",0,{"$f":"V643+T643+Q643+O643+I643+X643","v":0},{"$f":"Y643/1000","v":0},{"$f":"Y643*12","v":0},0]
[null,null,null,null,null,"Calentador a Gas",null,null,0,"Tecnología solar ",null,null,null,null,0,null,0," En transmilenio",null,0,"Nunca",0,"No dejo restos de alimentos",0,0,0,0,0]
[null,null,null,null,null,"Calentador a Gas",null,null,0,"Tecnología solar ",null,null,null,null,0,null,0," En transmilenio",null,0,"Nunca",0,"No dejo restos de alimentos",{"$f":"IF(W645=\"No dejo restos de alimentos\",(0),IF(W645=\"Un cuarto del plato\",(0.25*0.5*0.8312*30),IF(W645=\"La mitad del plato\",(0.5*0.5*0.8312*30),IF(W645=\"Tres cuartos del plato\",(0.75*0.5*0.8312*30)))))","v":0},0,0,0,0]
[null,null,null,null,null,"Calentador a Gas",null,null,0,"Tecnología solar ",null,null,null,null,0,null,0," En transmilenio",null,0,"Nunca",0,"No dejo restos de alimentos",0,0,0,0,0]
[null,null,null,null,null,"Calentador a Gas",null,null,0,"Tecnología solar ",null,null,null,null,0,null,0," En transmilenio",null,0,"Nunca",0,"No dejo restos de alimentos",0,0,0,0,0]
[null,null,null,null,null,"Calentador a Gas",null,null,0,"Tecnología solar ",null,null,null,null,0,null,0," En transmilenio",null,0,"Nunca",0,"No dejo restos de alimentos",0,0,0,0,0]
[null,null,null,null,null,"Calentador a Gas",null,null,0,"Tecnología solar ",null,null,null,null,0,null,0," En transmilenio",null,0,"Nunca",0,"No dejo restos de alimentos",0,0,0,0,0]
[null,null,null,null,null,"Calentador a Gas",null,null,0,"Tecnología solar ",null,null,null,null,0,null,0," En transmilenio",null,0,"Nunca",0,"No dejo restos de alimentos",0,0,0,0,0]
[null,null,null,null,null,"Calentador a Gas",null,null,0,"Tecnología solar ",null,null,null,null,0,null,0," En transmilenio",null,0,"Nunca",0,"No dejo restos de alimentos",0,0,0,0,0]
[null,null,null,null,null,"Calentador a Gas",null,null,0,"Tecnología solar ",null,null,null,null,0,null,0," En transmilenio",null,0,"Nunca",0,"No dejo restos de alimentos",0,0,0,0,0]
[null,null,null,null,null,"Calentador a Gas",null,null,0,"Tecnología solar ",null,null,null,null,0,null,0," En transmilenio",null,0,"Nunca",0,"No dejo restos de alimentos",0,0,0,0,0]
[null,null,null,null,null,"Calentador a Gas",null,null,0,"Tecnología solar ",null,null,null,null,0,null,0," En transmilenio",null,0,"Nunca",0,"No dejo restos de alimentos",0,0,0,0,0]
[null,null,null,null,null,"Calentador a Gas",null,null,0,"Tecnología solar ",null,null,null,null,0,null,0," En transmilenio",null,0,"Nunca",0,"No dejo restos de alimentos",0,0,0,0,0]
[null,null,null,null,null,"Calentador a Gas",null,null,0,"Tecnología solar ",null,null,null,null,0,null,0," En transmilenio",null,0,"Nunca",0,"No dejo restos de alimentos",0,0,0,0,0]
[null,null,null,null,null,"Calentador a Gas",null,null,0,"Tecnología solar ",null,null,null,null,0,null,0," En transmilenio",null,0,"Nunca",0,"No dejo restos de alimentos",0,0,0,0,0]
[null,null,null,null,null,"Calentador a Gas",null,null,0,"Tecnología solar ",null,null,null,null,0,null,0," En transmilenio",null,0,"Nunca",0,"No dejo restos de alimentos",0,0,0,0,0]
[null,null,null,null,null,"Calentador a Gas",null,null,0,"Tecnología solar ",null,null,null,null,0,null,0," En transmilenio",null,0,"Nunca",0,"No dejo restos de alimentos",0,0,0,0,0]
[null,null,null,null,null,"Calentador a Gas",null,null,0,"Tecnología solar ",null,null,null,null,0,null,0," En transmilenio",null,0,"Nunca",0,"No dejo restos de alimentos",0,0,0,0,0]
[null,null,null,null,null,"Calentador a Gas",null,null,0,"Tecnología solar ",null,null,null,null,0,null,0," En transmilenio",null,0,"Nunca",0,"No dejo restos de alimentos",0,0,0,0,0]
[null,null,null,null,null,"Calentador a Gas",null,null,0,"Tecnología solar ",null,null,null,null,0,null,0," En transmilenio",null,0,"Nunca",0,"No dejo restos de alimentos",0,0,0,0,0]
[null,null,null,null,null,"Calentador a Gas",null,null,0,"Tecnología solar ",null,null,null,null,0,null,0," En transmilenio",null,0,"Nunca",0,"No dejo restos de alimentos",0,0,0,0,0]
[null,null,null,null,null,"Calentador a Gas",null,null,0,"Tecnología solar ",null,null,null,null,0,null,0," En transmilenio",null,0,"Nunca",0,"No dejo restos de alimentos",0,0,0,0,0]
[null,null,null,null,null,"Calentador a Gas",null,null,0,"Tecnología solar ",null,null,null,null,0,null,0," En transmilenio",null,0,"Nunca",0,"No dejo restos de alimentos",0,0,0,0,0]
[null,null,null,null,null,"Calentador a Gas",null,null,0,"Tecnología solar ",null,null,null,null,0,null,0," En transmilenio",null,0,"Nunca",0,"No dejo restos de alimentos",0,0,0,0,0]
[null,null,null,null,null,"Calentador a Gas",null,null,0,"Tecnología solar ",null,null,null,null,0,null,0," En transmilenio",null,0,"Nunca",0,"No dejo restos de alimentos",0,0,0,0,0]
[null,null,null,null,null,"Calentador a Gas",null,null,0,"Tecnología solar ",null,null,null,null,0,null,0," En transmilenio",null,0,"Nunca",0,"No dejo restos de alimentos",0,0,0,0,0]
[null,null,null,null,null,"Calentador a Gas",null,null,0,"Tecnología solar ",null,null,null,null,0,null,0," En transmilenio",null,0,"Nunca",0,"No dejo restos de alimentos",0,0,0,0,0]
[null,null,null,null,null,"Calentador a Gas",null,null,0,"Tecnología solar ",null,null,null,null,0,null,0," En transmilenio",null,0,"Nunca",0,"No dejo restos de alimentos",0,0,0,0,0]
[null,null,null,null,null,"Calentador a Gas",null,null,0,"Tecnología solar ",null,null,null,null,0,null,0," En transmilenio",null,0,"Nunca",0,"No dejo restos de alimentos",0,0,0,0,0]
[null,null,null,null,null,"Calentador a Gas",null,null,0,"Tecnología solar ",null,null,null,null,0,null,0," En transmilenio",null,0,"Nunca",0,"No dejo restos de alimentos",0,0,0,0,0]
[null,null,null,null,null,"Calentador a Gas",null,null,0,"Tecnología solar ",null,null,null,null,0,null,0," En transmilenio",null,0,"Nunca",0,"No dejo restos de alimentos",0,0,0,0,0]
[null,null,null,null,null,"Calentador a Gas",null,null,0,"Tecnología solar ",null,null,null,null,0,null,0," En transmilenio",null,0,"Nunca",0,"No dejo restos de alimentos",0,0,0,0,0]
[null,null,null,null,null,"Calentador a Gas",null,null,0,"Tecnología solar ",null,null,null,null,0,null,0," En transmilenio",null,0,"Nunca",0,"No dejo restos de alimentos",0,0,0,0,0]
[null,null,null,null,null,"Calentador a Gas",null,null,0,"Tecnología solar ",null,null,null,null,0,null,0," En transmilenio",null,0,"Nunca",0,"No dejo restos de alimentos",0,0,0,0,0]
[null,null,null,null,null,"Calentador a Gas",null,null,0,"Tecnología solar ",null,null,null,null,0,null,0," En transmilenio",null,0,"Nunca",0,"No dejo restos de alimentos",0,0,0,0,0]
[null,null,null,null,null,"Calentador a Gas",null,null,0,"Tecnología solar ",null,null,null,null,0,null,0," En transmilenio",null,0,"Nunca",0,"No dejo restos de alimentos",0,0,0,0,0]
[null,null,null,null,null,"Calentador a Gas",null,null,0,"Tecnología solar ",null,null,null,null,0,null,0," En transmilenio",null,0,"Nunca",0,"No dejo restos de alimentos",0,0,0,0,0]
[null,null,null,null,null,"Calentador a Gas",null,null,0,"Tecnología solar ",null,null,null,null,0,null,0," En transmilenio",null,0,"Nunca",0,"No dejo restos de alimentos",0,0,0,0,0]
[null,null,null,null,null,"Calentador a Gas",null,null,0,"Tecnología solar ",null,null,null,null,0,null,0," En transmilenio",null,0,"Nunca",0,"No dejo restos de alimentos",0,0,0,0,0]
[null,null,null,null,null,"Calentador a Gas",null,null,0,"Tecnología solar ",null,null,null,null,0,null,0," En transmilenio",null,0,"Nunca",0,"No dejo restos de alimentos",0,0,0,0,0]
[null,null,null,null,null,"Calentador a Gas",null,null,0,"Tecnología solar ",null,null,null,null,0,null,0," En transmilenio",null,0,"Nunca",0,"No dejo restos de alimentos",0,0,0,0,0]
[null,null,null,null,null,"Calentador a Gas",null,null,0,"Tecnología solar ",null,null,null,null,0,null,0," En transmilenio",null,0,"Nunca",0,"No dejo restos de alimentos",0,0,0,0,0]
[null,null,null,null,null,"Calentador a Gas",null,null,0,"Tecnología solar ",null,null,null,null,0,null,0," En transmilenio",null,0,"Nunca",0,"No dejo restos de alimentos",0,0,0,0,0]
[null,null,null,null,null,"Calentador a Gas",null,null,0,"Tecnología solar ",null,null,null,null,0,null,0," En transmilenio",null,0,"Nunca",0,"No dejo restos de alimentos",0,0,0,0,0]
[null,null,null,null,null,"Calentador a Gas",null,null,0,"Tecnología solar ",null,null,null,null,0,null,0," En transmilenio",null,0,"Nunca",0,"No dejo restos de alimentos",0,0,0,0,0]
[null,null,null,null,null,"Calentador a Gas",null,null,0,"Tecnología solar ",null,null,null,null,0,null,0," En transmilenio",null,0,"Nunca",0,"No dejo restos de alimentos",0,0,0,0,0]
[null,null,null,null,null,"Calentador a Gas",null,null,0,"Tecnología solar ",null,null,null,null,0,null,0," En transmilenio",null,0,"Nunca",0,"No dejo restos de alimentos",0,0,0,0,0]
[null,null,null,null,null,"Calentador a Gas",null,null,0,"Tecnología solar ",null,null,null,null,0,null,0," En transmilenio",null,0,"Nunca",0,"No dejo restos de alimentos",0,0,0,0,0]
[null,null,null,null,null,"Calentador a Gas",null,null,0,"Tecnología solar ",null,null,null,null,0,null,0," En transmilenio",null,0,"Nunca",0,"No dejo restos de alimentos",0,0,0,0,0]
[null,null,null,null,null,"Calentador a Gas",null,null,0,"Tecnología solar ",null,null,null,null,0,null,0," En transmilenio",null,0,"Nunca",0,"No dejo restos de alimentos",0,0,0,0,0]
[null,null,null,null,null,"Calentador a Gas",null,null,0,"Tecnología solar ",null,null,null,null,0,null,0," En transmilenio",null,0,"Nunca",0,"No dejo restos de alimentos",0,0,0,0,0]
[null,null,null,null,null,"Calentador a Gas",null,null,0,"Tecnología solar ",null,null,null,null,0,null,0," En transmilenio",null,0,"Nunca",0,"No dejo restos de alimentos",0,0,0,0,0]
[null,null,null,null,null,"Calentador a Gas",null,null,0,"Tecnología solar ",null,null,null,null,0,null,0," En transmilenio",null,0,"Nunca",0,"No dejo restos de alimentos",0,0,0,0,0]
[null,null,null,null,null,"Calentador a Gas",null,null,0,"Tecnología solar ",null,null,null,null,0,null,0," En transmilenio",null,0,"Nunca",0,"No dejo restos de alimentos",0,0,0,0,0]
[null,null,null,null,null,"Calentador a Gas",null,null,0,"Tecnología solar ",null,null,null,null,0,null,0," En transmilenio",null,0,"Nunca",0,"No dejo restos de alimentos",0,0,0,0,0]
[null,null,null,null,null,"Calentador a Gas",null,null,0,"Tecnología solar ",null,null,null,null,0,null,0," En transmilenio",null,0,"Nunca",0,"No dejo restos de alimentos",0,0,0,0,0]
[null,null,null,null,null,"Calentador a Gas",null,null,0,"Tecnología solar ",null,null,null,null,0,null,0," En transmilenio",null,0,"Nunca",0,"No dejo restos de alimentos",0,0,0,0,0]
[null,null,null,null,null,"Calentador a Gas",null,null,0,"Tecnología solar ",null,null,null,null,0,null,0," En transmilenio",null,0,"Nunca",0,"No dejo restos de alimentos",0,0,0,0,0]
[null,null,null,null,null,"Calentador a Gas",null,null,0,"Tecnología solar ",null,null,null,null,0,null,0," En transmilenio",null,0,"Nunca",0,"No dejo restos de alimentos",0,0,0,0,0]
[null,null,null,null,null,"Calentador a Gas",null,null,0,"Tecnología solar ",null,null,null,null,0,null,0," En transmilenio",null,0,"Nunca",0,"No dejo restos de alimentos",0,0,0,0,0]
[null,null,null,null,null,"Calentador a Gas",null,null,0,"Tecnología solar ",null,null,null,null,0,null,0," En transmilenio",null,0,"Nunca",0,"No dejo restos de alimentos",0,0,0,0,0]
[null,null,null,null,null,"Calentador a Gas",null,null,0,"Tecnología solar ",null,null,null,null,0,null,0," En transmilenio",null,0,"Nunca",0,"No dejo restos de alimentos",0,0,0,0,0]
[null,null,null,null,null,"Calentador a Gas",null,null,0,"Tecnología solar ",null,null,null,null,0,null,0," En transmilenio",null,0,"Nunca",0,"No dejo restos de alimentos",0,0,0,0,0]
[null,null,null,null,null,"Calentador a Gas",null,null,0,"Tecnología solar ",null,null,null,null,0,null,0," En transmilenio",null,0,"Nunca",{"$f":"IF(U706=\"Nunca\",0,IF(U706=\"3 veces por semana\",\"513\",IF(U706=\"5 veces por semana\",855,IF(U706=\"Todos los días\",1197))))","v":0},"No dejo restos de alimentos",0,0,0,0,0]
[null,null,null,null,null,"Calentador a Gas",null,null,{"$f":"IF(F707=\"Calentador a Gas\",(H707*1.6*1.98*30),IF(F707=\"Calentador Eléctrico\",(H707*1.3*0.199*30),IF(F707=\"Ducha Eléctrica\",(H707*4*0.199*30),IF(F707=\"Ninguno\",\"0\"))))","v":0},"Tecnología solar ",null,null,null,null,{"$f":"IF(J707=\"Ahorradores \",(K707*0.02*5*0.199*30),IF(J707=\"Incandescentes \",(M707*0.1*5*0.199*30),IF(J707=\"LED\",(L707*0.007*5*0.199*30),IF(J707=\"Tecnología solar \",(N707*0)))))","v":0},null,{"$f":"P707*9*0.8312","v":0}," En transmilenio",null,{"$f":"IF(R707=\"En bicicleta\",(0*S707),IF(R707=\"En carro\",(0.218 *S707),IF(R707=\"En bus o SITP \",((0.78703*S707)/40),IF(R707=\" En transmilenio\",((0.68516*S707)/140)))))","v":0},"Nunca",0,"No dejo restos de alimentos",0,{"$f":"V707+T707+Q707+O707+I707+X707","v":0},{"$f":"Y707/1000","v":0},{"$f":"Y707*12","v":0},0]
[null,null,null,null,null,"Calentador a Gas",null,null,0,"Tecnología solar ",null,null,null,null,0,null,0," En transmilenio",null,0,"Nunca",0,"No dejo restos de alimentos",0,0,0,0,0]
[null,null,null,null,null,"Calentador a Gas",null,null,0,"Tecnología solar ",null,null,null,null,0,null,0," En transmilenio",null,0,"Nunca",0,"No dejo restos de alimentos",{"$f":"IF(W709=\"No dejo restos de alimentos\",(0),IF(W709=\"Un cuarto del plato\",(0.25*0.5*0.8312*30),IF(W709=\"La mitad del plato\",(0.5*0.5*0.8312*30),IF(W709=\"Tres cuartos del plato\",(0.75*0.5*0.8312*30)))))","v":0},0,0,0,0]
[null,null,null,null,null,"Calentador a Gas",null,null,0,"Tecnología solar ",null,null,null,null,0,null,0," En transmilenio",null,0,"Nunca",0,"No dejo restos de alimentos",0,0,0,0,0]
[null,null,null,null,null,"Calentador a Gas",null,null,0,"Tecnología solar ",null,null,null,null,0,null,0," En transmilenio",null,0,"Nunca",0,"No dejo restos de alimentos",0,0,0,0,0]
[null,null,null,null,null,"Calentador a Gas",null,null,0,"Tecnología solar ",null,null,null,null,0,null,0," En transmilenio",null,0,"Nunca",0,"No dejo restos de alimentos",0,0,0,0,0]
[null,null,null,null,null,"Calentador a Gas",null,null,0,"Tecnología solar ",null,null,null,null,0,null,0," En transmilenio",null,0,"Nunca",0,"No dejo restos de alimentos",0,0,0,0,0]
[null,null,null,null,null,"Calentador a Gas",null,null,0,"Tecnología solar ",null,null,null,null,0,null,0," En transmilenio",null,0,"Nunca",0,"No dejo restos de alimentos",0,0,0,0,0]
[null,null,null,null,null,"Calentador a Gas",null,null,0,"Tecnología solar ",null,null,null,null,0,null,0," En transmilenio",null,0,"Nunca",0,"No dejo restos de alimentos",0,0,0,0,0]
[null,null,null,null,null,"Calentador a Gas",null,null,0,"Tecnología solar ",null,null,null,null,0,null,0," En transmilenio",null,0,"Nunca",0,"No dejo restos de alimentos",0,0,0,0,0]
[null,null,null,null,null,"Calentador a Gas",null,null,0,"Tecnología solar ",null,null,null,null,0,null,0," En transmilenio",null,0,"Nunca",0,"No dejo restos de alimentos",0,0,0,0,0]
[null,null,null,null,null,"Calentador a Gas",null,null,0,"Tecnología solar ",null,null,null,null,0,null,0," En transmilenio",null,0,"Nunca",0,"No dejo restos de alimentos",0,0,0,0,0]
[null,null,null,null,null,"Calentador a Gas",null,null,0,"Tecnología solar ",null,null,null,null,0,null,0," En transmilenio",null,0,"Nunca",0,"No dejo restos de alimentos",0,0,0,0,0]
[null,null,null,null,null,"Calentador a Gas",null,null,0,"Tecnología solar ",null,null,null,null,0,null,0," En transmilenio",null,0,"Nunca",0,"No dejo restos de alimentos",0,0,0,0,0]
[null,null,null,null,null,"Calentador a Gas",null,null,0,"Tecnología solar ",null,null,null,null,0,null,0," En transmilenio",null,0,"Nunca",0,"No dejo restos de alimentos",0,0,0,0,0]
[null,null,null,null,null,"Calentador a Gas",null,null,0,"Tecnología solar ",null,null,null,null,0,null,0," En transmilenio",null,0,"Nunca",0,"No dejo restos de alimentos",0,0,0,0,0]
[null,null,null,null,null,"Calentador a Gas",null,null,0,"Tecnología solar ",null,null,null,null,0,null,0," En transmilenio",null,0,"Nunca",0,"No dejo restos de alimentos",0,0,0,0,0]
[null,null,null,null,null,"Calentador a Gas",null,null,0,"Tecnología solar ",null,null,null,null,0,null,0," En transmilenio",null,0,"Nunca",0,"No dejo restos de alimentos",0,0,0,0,0]
[null,null,null,null,null,"Calentador a Gas",null,null,0,"Tecnología solar ",null,null,null,null,0,null,0," En transmilenio",null,0,"Nunca",0,"No dejo restos de alimentos",0,0,0,0,0]
[null,null,null,null,null,"Calentador a Gas",null,null,0,"Tecnología solar ",null,null,null,null,0,null,0," En transmilenio",null,0,"Nunca",0,"No dejo restos de alimentos",0,0,0,0,0]
[null,null,null,null,null,"Calentador a Gas",null,null,0,"Tecnología solar ",null,null,null,null,0,null,0," En transmilenio",null,0,"Nunca",0,"No dejo restos de alimentos",0,0,0,0,0]
[null,null,null,null,null,"Calentador a Gas",null,null,0,"Tecnología solar ",null,null,null,null,0,null,0," En transmilenio",null,0,"Nunca",0,"No dejo restos de alimentos",0,0,0,0,0]
[null,null,null,null,null,"Calentador a Gas",null,null,0,"Tecnología solar ",null,null,null,null,0,null,0," En transmilenio",null,0,"Nunca",0,"No dejo restos de alimentos",0,0,0,0,0]
[null,null,null,null,null,"Calentador a Gas",null,null,0,"Tecnología solar ",null,null,null,null,0,null,0," En transmilenio",null,0,"Nunca",0,"No dejo restos de alimentos",0,0,0,0,0]
[null,null,null,null,null,"Calentador a Gas",null,null,0,"Tecnología solar ",null,null,null,null,0,null,0," En transmilenio",null,0,"Nunca",0,"No dejo restos de alimentos",0,0,0,0,0]
[null,null,null,null,null,"Calentador a Gas",null,null,0,"Tecnología solar ",null,null,null,null,0,null,0," En transmilenio",null,0,"Nunca",0,"No dejo restos de alimentos",0,0,0,0,0]
[null,null,null,null,null,"Calentador a Gas",null,null,0,"Tecnología solar ",null,null,null,null,0,null,0," En transmilenio",null,0,"Nunca",0,"No dejo restos de alimentos",0,0,0,0,0]
[null,null,null,null,null,"Calentador a Gas",null,null,0,"Tecnología solar ",null,null,null,null,0,null,0," En transmilenio",null,0,"Nunca",0,"No dejo restos de alimentos",0,0,0,0,0]
[null,null,null,null,null,"Calentador a Gas",null,null,0,"Tecnología solar ",null,null,null,null,0,null,0," En transmilenio",null,0,"Nunca",0,"No dejo restos de alimentos",0,0,0,0,0]
[null,null,null,null,null,"Calentador a Gas",null,null,0,"Tecnología solar ",null,null,null,null,0,null,0," En transmilenio",null,0,"Nunca",0,"No dejo restos de alimentos",0,0,0,0,0]
[null,null,null,null,null,"Calentador a Gas",null,null,0,"Tecnología solar ",null,null,null,null,0,null,0," En transmilenio",null,0,"Nunca",0,"No dejo restos de alimentos",0,0,0,0,0]
[null,null,null,null,null,"Calentador a Gas",null,null,0,"Tecnología solar ",null,null,null,null,0,null,0," En transmilenio",null,0,"Nunca",0,"No dejo restos de alimentos",0,0,0,0,0]
[null,null,null,null,null,"Calentador a Gas",null,null,0,"Tecnología solar ",null,null,null,null,0,null,0," En transmilenio",null,0,"Nunca",0,"No dejo restos de alimentos",0,0,0,0,0]
[null,null,null,null,null,"Calentador a Gas",null,null,0,"Tecnología solar ",null,null,null,null,0,null,0," En transmilenio",null,0,"Nunca",0,"No dejo restos de alimentos",0,0,0,0,0]
[null,null,null,null,null,"Calentador a Gas",null,null,0,"Tecnología solar ",null,null,null,null,0,null,0," En transmilenio",null,0,"Nunca",0,"No dejo restos de alimentos",0,0,0,0,0]
[null,null,null,null,null,"Calentador a Gas",null,null,0,"Tecnología solar ",null,null,null,null,0,null,0," En transmilenio",null,0,"Nunca",0,"No dejo restos de alimentos",0,0,0,0,0]
[null,null,null,null,null,"Calentador a Gas",null,null,0,"Tecnología solar ",null,null,null,null,0,null,0," En transmilenio",null,0,"Nunca",0,"No dejo restos de alimentos",0,0,0,0,0]
[null,null,null,null,null,"Calentador a Gas",null,null,0,"Tecnología solar ",null,null,null,null,0,null,0," En transmilenio",null,0,"Nunca",0,"No dejo restos de alimentos",0,0,0,0,0]
[null,null,null,null,null,"Calentador a Gas",null,null,0,"Tecnología solar ",null,null,null,null,0,null,0," En transmilenio",null,0,"Nunca",0,"No dejo restos de alimentos",0,0,0,0,0]
[null,null,null,null,null,"Calentador a Gas",null,null,0,"Tecnología solar ",null,null,null,null,0,null,0," En transmilenio",null,0,"Nunca",0,"No dejo restos de alimentos",0,0,0,0,0]
[null,null,null,null,null,"Calentador a Gas",null,null,0,"Tecnología solar ",null,null,null,null,0,null,0," En transmilenio",null,0,"Nunca",0,"No dejo restos de alimentos",0,0,0,0,0]
[null,null,null,null,null,"Calentador a Gas",null,null,0,"Tecnología solar ",null,null,null,null,0,null,0," En transmilenio",null,0,"Nunca",0,"No dejo restos de alimentos",0,0,0,0,0]
[null,null,null,null,null,"Calentador a Gas",null,null,0,"Tecnología solar ",null,null,null,null,0,null,0," En transmilenio",null,0,"Nunca",0,"No dejo restos de alimentos",0,0,0,0,0]
[null,null,null,null,null,"Calentador a Gas",null,null,0,"Tecnología solar ",null,null,null,null,0,null,0," En transmilenio",null,0,"Nunca",0,"No dejo restos de alimentos",0,0,0,0,0]
[null,null,null,null,null,"Calentador a Gas",null,null,0,"Tecnología solar ",null,null,null,null,0,null,0," En transmilenio",null,0,"Nunca",0,"No dejo restos de alimentos",0,0,0,0,0]
[null,null,null,null,null,"Calentador a Gas",null,null,0,"Tecnología solar ",null,null,null,null,0,null,0," En transmilenio",null,0,"Nunca",0,"No dejo restos de alimentos",0,0,0,0,0]
[null,null,null,null,null,"Calentador a Gas",null,null,0,"Tecnología solar ",null,null,null,null,0,null,0," En transmilenio",null,0,"Nunca",0,"No dejo restos de alimentos",0,0,0,0,0]
[null,null,null,null,null,"Calentador a Gas",null,null,0,"Tecnología solar ",null,null,null,null,0,null,0," En transmilenio",null,0,"Nunca",0,"No dejo restos de alimentos",0,0,0,0,0]
[null,null,null,null,null,"Calentador a Gas",null,null,0,"Tecnología solar ",null,null,null,null,0,null,0," En transmilenio",null,0,"Nunca",0,"No dejo restos de alimentos",0,0,0,0,0]
[null,null,null,null,null,"Calentador a Gas",null,null,0,"Tecnología solar ",null,null,null,null,0,null,0," En transmilenio",null,0,"Nunca",0,"No dejo restos de alimentos",0,0,0,0,0]
[null,null,null,null,null,"Calentador a Gas",null,null,0,"Tecnología solar ",null,null,null,null,0,null,0," En transmilenio",null,0,"Nunca",0,"No dejo restos de alimentos",0,0,0,0,0]
[null,null,null,null,null,"Calentador a Gas",null,null,0,"Tecnología solar ",null,null,null,null,0,null,0," En transmilenio",null,0,"Nunca",0,"No dejo restos de alimentos",0,0,0,0,0]
[null,null,null,null,null,"Calentador a Gas",null,null,0,"Tecnología solar ",null,null,null,null,0,null,0," En transmilenio",null,0,"Nunca",0,"No dejo restos de alimentos",0,0,0,0,0]
[null,null,null,null,null,"Calentador a Gas",null,null,0,"Tecnología solar ",null,null,null,null,0,null,0," En transmilenio",null,0,"Nunca",0,"No dejo restos de alimentos",0,0,0,0,0]
[null,null,null,null,null,"Calentador a Gas",null,null,0,"Tecnología solar ",null,null,null,null,0,null,0," En transmilenio",null,0,"Nunca",0,"No dejo restos de alimentos",0,0,0,0,0]
[null,null,null,null,null,"Calentador a Gas",null,null,0,"Tecnología solar ",null,null,null,null,0,null,0," En transmilenio",null,0,"Nunca",0,"No dejo restos de alimentos",0,0,0,0,0]
[null,null,null,null,null,"Calentador a Gas",null,null,0,"Tecnología solar ",null,null,null,null,0,null,0," En transmilenio",null,0,"Nunca",0,"No dejo restos de alimentos",0,0,0,0,0]
[null,null,null,null,null,"Calentador a Gas",null,null,0,"Tecnología solar ",null,null,null,null,0,null,0," En transmilenio",null,0,"Nunca",0,"No dejo restos de alimentos",0,0,0,0,0]
[null,null,null,null,null,"Calentador a Gas",null,null,0,"Tecnología solar ",null,null,null,null,0,null,0," En transmilenio",null,0,"Nunca",0,"No dejo restos de alimentos",0,0,0,0,0]
[null,null,null,null,null,"Calentador a Gas",null,null,0,"Tecnología solar ",null,null,null,null,0,null,0," En transmilenio",null,0,"Nunca",0,"No dejo restos de alimentos",0,0,0,0,0]
[null,null,null,null,null,"Calentador a Gas",null,null,0,"Tecnología solar ",null,null,null,null,0,null,0," En transmilenio",null,0,"Nunca",0,"No dejo restos de alimentos",0,0,0,0,0]
[null,null,null,null,null,"Calentador a Gas",null,null,0,"Tecnología solar ",null,null,null,null,0,null,0," En transmilenio",null,0,"Nunca",0,"No dejo restos de alimentos",0,0,0,0,0]
[null,null,null,null,null,"Calentador a Gas",null,null,0,"Tecnología solar ",null,null,null,null,0,null,0," En transmilenio",null,0,"Nunca",0,"No dejo restos de alimentos",0,0,0,0,0]
[null,null,null,null,null,"Calentador a Gas",null,null,0,"Tecnología solar ",null,null,null,null,0,null,0," En transmilenio",null,0,"Nunca",{"$f":"IF(U770=\"Nunca\",0,IF(U770=\"3 veces por semana\",\"513\",IF(U770=\"5 veces por semana\",855,IF(U770=\"Todos los días\",1197))))","v":0},"No dejo restos de alimentos",0,0,0,0,0]
[null,null,null,null,null,"Calentador a Gas",null,null,{"$f":"IF(F771=\"Calentador a Gas\",(H771*1.6*1.98*30),IF(F771=\"Calentador Eléctrico\",(H771*1.3*0.199*30),IF(F771=\"Ducha Eléctrica\",(H771*4*0.199*30),IF(F771=\"Ninguno\",\"0\"))))","v":0},"Tecnología solar ",null,null,null,null,{"$f":"IF(J771=\"Ahorradores \",(K771*0.02*5*0.199*30),IF(J771=\"Incandescentes \",(M771*0.1*5*0.199*30),IF(J771=\"LED\",(L771*0.007*5*0.199*30),IF(J771=\"Tecnología solar \",(N771*0)))))","v":0},null,{"$f":"P771*9*0.8312","v":0}," En transmilenio",null,{"$f":"IF(R771=\"En bicicleta\",(0*S771),IF(R771=\"En carro\",(0.218 *S771),IF(R771=\"En bus o SITP \",((0.78703*S771)/40),IF(R771=\" En transmilenio\",((0.68516*S771)/140)))))","v":0},"Nunca",0,"No dejo restos de alimentos",0,{"$f":"V771+T771+Q771+O771+I771+X771","v":0},{"$f":"Y771/1000","v":0},{"$f":"Y771*12","v":0},0]
[null,null,null,null,null,"Calentador a Gas",null,null,0,"Tecnología solar ",null,null,null,null,0,null,0," En transmilenio",null,0,"Nunca",0,"No dejo restos de alimentos",0,0,0,0,0]
[null,null,null,null,null,"Calentador a Gas",null,null,0,"Tecnología solar ",null,null,null,null,0,null,0," En transmilenio",null,0,"Nunca",0,"No dejo restos de alimentos",{"$f":"IF(W773=\"No dejo restos de alimentos\",(0),IF(W773=\"Un cuarto del plato\",(0.25*0.5*0.8312*30),IF(W773=\"La mitad del plato\",(0.5*0.5*0.8312*30),IF(W773=\"Tres cuartos del plato\",(0.75*0.5*0.8312*30)))))","v":0},0,0,0,0]
[null,null,null,null,null,"Calentador a Gas",null,null,0,"Tecnología solar ",null,null,null,null,0,null,0," En transmilenio",null,0,"Nunca",0,"No dejo restos de alimentos",0,0,0,0,0]
[null,null,null,null,null,"Calentador a Gas",null,null,0,"Tecnología solar ",null,null,null,null,0,null,0," En transmilenio",null,0,"Nunca",0,"No dejo restos de alimentos",0,0,0,0,0]
[null,null,null,null,null,"Calentador a Gas",null,null,0,"Tecnología solar ",null,null,null,null,0,null,0," En transmilenio",null,0,"Nunca",0,"No dejo restos de alimentos",0,0,0,0,0]
[null,null,null,null,null,"Calentador a Gas",null,null,0,"Tecnología solar ",null,null,null,null,0,null,0," En transmilenio",null,0,"Nunca",0,"No dejo restos de alimentos",0,0,0,0,0]
[null,null,null,null,null,"Calentador a Gas",null,null,0,"Tecnología solar ",null,null,null,null,0,null,0," En transmilenio",null,0,"Nunca",0,"No dejo restos de alimentos",0,0,0,0,0]
[null,null,null,null,null,"Calentador a Gas",null,null,0,"Tecnología solar ",null,null,null,null,0,null,0," En transmilenio",null,0,"Nunca",0,"No dejo restos de alimentos",0,0,0,0,0]
[null,null,null,null,null,"Calentador a Gas",null,null,0,"Tecnología solar ",null,null,null,null,0,null,0," En transmilenio",null,0,"Nunca",0,"No dejo restos de alimentos",0,0,0,0,0]
[null,null,null,null,null,"Calentador a Gas",null,null,0,"Tecnología solar ",null,null,null,null,0,null,0," En transmilenio",null,0,"Nunca",0,"No dejo restos de alimentos",0,0,0,0,0]
[null,null,null,null,null,"Calentador a Gas",null,null,0,"Tecnología solar ",null,null,null,null,0,null,0," En transmilenio",null,0,"Nunca",0,"No dejo restos de alimentos",0,0,0,0,0]
[null,null,null,null,null,"Calentador a Gas",null,null,0,"Tecnología solar ",null,null,null,null,0,null,0," En transmilenio",null,0,"Nunca",0,"No dejo restos de alimentos",0,0,0,0,0]
[null,null,null,null,null,"Calentador a Gas",null,null,0,"Tecnología solar ",null,null,null,null,0,null,0," En transmilenio",null,0,"Nunca",0,"No dejo restos de alimentos",0,0,0,0,0]
[null,null,null,null,null,"Calentador a Gas",null,null,0,"Tecnología solar ",null,null,null,null,0,null,0," En transmilenio",null,0,"Nunca",0,"No dejo restos de alimentos",0,0,0,0,0]
[null,null,null,null,null,"Calentador a Gas",null,null,0,"Tecnología solar ",null,null,null,null,0,null,0," En transmilenio",null,0,"Nunca",0,"No dejo restos de alimentos",0,0,0,0,0]
[null,null,null,null,null,"Calentador a Gas",null,null,0,"Tecnología solar ",null,null,null,null,0,null,0," En transmilenio",null,0,"Nunca",0,"No dejo restos de alimentos",0,0,0,0,0]
[null,null,null,null,null,"Calentador a Gas",null,null,0,"Tecnología solar ",null,null,null,null,0,null,0," En transmilenio",null,0,"Nunca",0,"No dejo restos de alimentos",0,0,0,0,0]
[null,null,null,null,null,"Calentador a Gas",null,null,0,"Tecnología solar ",null,null,null,null,0,null,0," En transmilenio",null,0,"Nunca",0,"No dejo restos de alimentos",0,0,0,0,0]
[null,null,null,null,null,"Calentador a Gas",null,null,0,"Tecnología solar ",null,null,null,null,0,null,0," En transmilenio",null,0,"Nunca",0,"No dejo restos de alimentos",0,0,0,0,0]
[null,null,null,null,null,"Calentador a Gas",null,null,0,"Tecnología solar ",null,null,null,null,0,null,0," En transmilenio",null,0,"Nunca",0,"No dejo restos de alimentos",0,0,0,0,0]
[null,null,null,null,null,"Calentador a Gas",null,null,0,"Tecnología solar ",null,null,null,null,0,null,0," En transmilenio",null,0,"Nunca",0,"No dejo restos de alimentos",0,0,0,0,0]
[null,null,null,null,null,"Calentador a Gas",null,null,0,"Tecnología solar ",null,null,null,null,0,null,0," En transmilenio",null,0,"Nunca",0,"No dejo restos de alimentos",0,0,0,0,0]
[null,null,null,null,null,"Calentador a Gas",null,null,0,"Tecnología solar ",null,null,null,null,0,null,0," En transmilenio",null,0,"Nunca",0,"No dejo restos de alimentos",0,0,0,0,0]
[null,null,null,null,null,"Calentador a Gas",null,null,0,"Tecnología solar ",null,null,null,null,0,null,0," En transmilenio",null,0,"Nunca",0,"No dejo restos de alimentos",0,0,0,0,0]
[null,null,null,null,null,"Calentador a Gas",null,null,0,"Tecnología solar ",null,null,null,null,0,null,0," En transmilenio",null,0,"Nunca",0,"No dejo restos de alimentos",0,0,0,0,0]
[null,null,null,null,null,"Calentador a Gas",null,null,0,"Tecnología solar ",null,null,null,null,0,null,0," En transmilenio",null,0,"Nunca",0,"No dejo restos de alimentos",0,0,0,0,0]
[null,null,null,null,null,"Calentador a Gas",null,null,0,"Tecnología solar ",null,null,null,null,0,null,0," En transmilenio",null,0,"Nunca",0,"No dejo restos de alimentos",0,0,0,0,0]
[null,null,null,null,null,"Calentador a Gas",null,null,0,"Tecnología solar ",null,null,null,null,0,null,0," En transmilenio",null,0,"Nunca",0,"No dejo restos de alimentos",0,0,0,0,0]
[null,null,null,null,null,"Calentador a Gas",null,null,0,"Tecnología solar ",null,null,null,null,0,null,0," En transmilenio",null,0,"Nunca",0,"No dejo restos de alimentos",0,0,0,0,0]
[null,null,null,null,null,"Calentador a Gas",null,null,0,"Tecnología solar ",null,null,null,null,0,null,0," En transmilenio",null,0,"Nunca",0,"No dejo restos de alimentos",0,0,0,0,0]
[null,null,null,null,null,"Calentador a Gas",null,null,0,"Tecnología solar ",null,null,null,null,0,null,0," En transmilenio",null,0,"Nunca",0,"No dejo restos de alimentos",0,0,0,0,0]
[null,null,null,null,null,"Calentador a Gas",null,null,0,"Tecnología solar ",null,null,null,null,0,null,0," En transmilenio",null,0,"Nunca",0,"No dejo restos de alimentos",0,0,0,0,0]
[null,null,null,null,null,"Calentador a Gas",null,null,0,"Tecnología solar ",null,null,null,null,0,null,0," En transmilenio",null,0,"Nunca",0,"No dejo restos de alimentos",0,0,0,0,0]
[null,null,null,null,null,"Calentador a Gas",null,null,0,"Tecnología solar ",null,null,null,null,0,null,0," En transmilenio",null,0,"Nunca",0,"No dejo restos de alimentos",0,0,0,0,0]
[null,null,null,null,null,"Calentador a Gas",null,null,0,"Tecnología solar ",null,null,null,null,0,null,0," En transmilenio",null,0,"Nunca",0,"No dejo restos de alimentos",0,0,0,0,0]
[null,null,null,null,null,"Calentador a Gas",null,null,0,"Tecnología solar ",null,null,null,null,0,null,0," En transmilenio",null,0,"Nunca",0,"No dejo restos de alimentos",0,0,0,0,0]
[null,null,null,null,null,"Calentador a Gas",null,null,0,"Tecnología solar ",null,null,null,null,0,null,0," En transmilenio",null,0,"Nunca",0,"No dejo restos de alimentos",0,0,0,0,0]
[null,null,null,null,null,"Calentador a Gas",null,null,0,"Tecnología solar ",null,null,null,null,0,null,0," En transmilenio",null,0,"Nunca",0,"No dejo restos de alimentos",0,0,0,0,0]
[null,null,null,null,null,"Calentador a Gas",null,null,0,"Tecnología solar ",null,null,null,null,0,null,0," En transmilenio",null,0,"Nunca",0,"No dejo restos de alimentos",0,0,0,0,0]
[null,null,null,null,null,"Calentador a Gas",null,null,0,"Tecnología solar ",null,null,null,null,0,null,0," En transmilenio",null,0,"Nunca",0,"No dejo restos de alimentos",0,0,0,0,0]
[null,null,null,null,null,"Calentador a Gas",null,null,0,"Tecnología solar ",null,null,null,null,0,null,0," En transmilenio",null,0,"Nunca",0,"No dejo restos de alimentos",0,0,0,0,0]
[null,null,null,null,null,"Calentador a Gas",null,null,0,"Tecnología solar ",null,null,null,null,0,null,0," En transmilenio",null,0,"Nunca",0,"No dejo restos de alimentos",0,0,0,0,0]
[null,null,null,null,null,"Calentador a Gas",null,null,0,"Tecnología solar ",null,null,null,null,0,null,0," En transmilenio",null,0,"Nunca",0,"No dejo restos de alimentos",0,0,0,0,0]
[null,null,null,null,null,"Calentador a Gas",null,null,0,"Tecnología solar ",null,null,null,null,0,null,0," En transmilenio",null,0,"Nunca",0,"No dejo restos de alimentos",0,0,0,0,0]
[null,null,null,null,null,"Calentador a Gas",null,null,0,"Tecnología solar ",null,null,null,null,0,null,0," En transmilenio",null,0,"Nunca",0,"No dejo restos de alimentos",0,0,0,0,0]
[null,null,null,null,null,"Calentador a Gas",null,null,0,"Tecnología solar ",null,null,null,null,0,null,0," En transmilenio",null,0,"Nunca",0,"No dejo restos de alimentos",0,0,0,0,0]
[null,null,null,null,null,"Calentador a Gas",null,null,0,"Tecnología solar ",null,null,null,null,0,null,0," En transmilenio",null,0,"Nunca",0,"No dejo restos de alimentos",0,0,0,0,0]
[null,null,null,null,null,"Calentador a Gas",null,null,0,"Tecnología solar ",null,null,null,null,0,null,0," En transmilenio",null,0,"Nunca",0,"No dejo restos de alimentos",0,0,0,0,0]
[null,null,null,null,null,"Calentador a Gas",null,null,0,"Tecnología solar ",null,null,null,null,0,null,0," En transmilenio",null,0,"Nunca",0,"No dejo restos de alimentos",0,0,0,0,0]
[null,null,null,null,null,"Calentador a Gas",null,null,0,"Tecnología solar ",null,null,null,null,0,null,0," En transmilenio",null,0,"Nunca",0,"No dejo restos de alimentos",0,0,0,0,0]
[null,null,null,null,null,"Calentador a Gas",null,null,0,"Tecnología solar ",null,null,null,null,0,null,0," En transmilenio",null,0,"Nunca",0,"No dejo restos de alimentos",0,0,0,0,0]
[null,null,null,null,null,"Calentador a Gas",null,null,0,"Tecnología solar ",null,null,null,null,0,null,0," En transmilenio",null,0,"Nunca",0,"No dejo restos de alimentos",0,0,0,0,0]
[null,null,null,null,null,"Calentador a Gas",null,null,0,"Tecnología solar ",null,null,null,null,0,null,0," En transmilenio",null,0,"Nunca",0,"No dejo restos de alimentos",0,0,0,0,0]
[null,null,null,null,null,"Calentador a Gas",null,null,0,"Tecnología solar ",null,null,null,null,0,null,0," En transmilenio",null,0,"Nunca",0,"No dejo restos de alimentos",0,0,0,0,0]
[null,null,null,null,null,"Calentador a Gas",null,null,0,"Tecnología solar ",null,null,null,null,0,null,0," En transmilenio",null,0,"Nunca",0,"No dejo restos de alimentos",0,0,0,0,0]
[null,null,null,null,null,"Calentador a Gas",null,null,0,"Tecnología solar ",null,null,null,null,0,null,0," En transmilenio",null,0,"Nunca",0,"No dejo restos de alimentos",0,0,0,0,0]
[null,null,null,null,null,"Calentador a Gas",null,null,0,"Tecnología solar ",null,null,null,null,0,null,0," En transmilenio",null,0,"Nunca",0,"No dejo restos de alimentos",0,0,0,0,0]
[null,null,null,null,null,"Calentador a Gas",null,null,0,"Tecnología solar ",null,null,null,null,0,null,0," En transmilenio",null,0,"Nunca",0,"No dejo restos de alimentos",0,0,0,0,0]
[null,null,null,null,null,"Calentador a Gas",null,null,0,"Tecnología solar ",null,null,null,null,0,null,0," En transmilenio",null,0,"Nunca",0,"No dejo restos de alimentos",0,0,0,0,0]
[null,null,null,null,null,"Calentador a Gas",null,null,0,"Tecnología solar ",null,null,null,null,0,null,0," En transmilenio",null,0,"Nunca",0,"No dejo restos de alimentos",0,0,0,0,0]
[null,null,null,null,null,"Calentador a Gas",null,null,0,"Tecnología solar ",null,null,null,null,0,null,0," En transmilenio",null,0,"Nunca",0,"No dejo restos de alimentos",0,0,0,0,0]
[null,null,null,null,null,"Calentador a Gas",null,null,0,"Tecnología solar ",null,null,null,null,0,null,0," En transmilenio",null,0,"Nunca",0,"No dejo restos de alimentos",0,0,0,0,0]
[null,null,null,null,null,"Calentador a Gas",null,null,0,"Tecnología solar ",null,null,null,null,0,null,0," En transmilenio",null,0,"Nunca",{"$f":"IF(U834=\"Nunca\",0,IF(U834=\"3 veces por semana\",\"513\",IF(U834=\"5 veces por semana\",855,IF(U834=\"Todos los días\",1197))))","v":0},"No dejo restos de alimentos",0,0,0,0,0]
[null,null,null,null,null,"Calentador a Gas",null,null,{"$f":"IF(F835=\"Calentador a Gas\",(H835*1.6*1.98*30),IF(F835=\"Calentador Eléctrico\",(H835*1.3*0.199*30),IF(F835=\"Ducha Eléctrica\",(H835*4*0.199*30),IF(F835=\"Ninguno\",\"0\"))))","v":0},"Tecnología solar ",null,null,null,null,{"$f":"IF(J835=\"Ahorradores \",(K835*0.02*5*0.199*30),IF(J835=\"Incandescentes \",(M835*0.1*5*0.199*30),IF(J835=\"LED\",(L835*0.007*5*0.199*30),IF(J835=\"Tecnología solar \",(N835*0)))))","v":0},null,{"$f":"P835*9*0.8312","v":0}," En transmilenio",null,{"$f":"IF(R835=\"En bicicleta\",(0*S835),IF(R835=\"En carro\",(0.218 *S835),IF(R835=\"En bus o SITP \",((0.78703*S835)/40),IF(R835=\" En transmilenio\",((0.68516*S835)/140)))))","v":0},"Nunca",0,"No dejo restos de alimentos",0,{"$f":"V835+T835+Q835+O835+I835+X835","v":0},{"$f":"Y835/1000","v":0},{"$f":"Y835*12","v":0},0]
[null,null,null,null,null,"Calentador a Gas",null,null,0,"Tecnología solar ",null,null,null,null,0,null,0," En transmilenio",null,0,"Nunca",0,"No dejo restos de alimentos",0,0,0,0,0]
[null,null,null,null,null,"Calentador a Gas",null,null,0,"Tecnología solar ",null,null,null,null,0,null,0," En transmilenio",null,0,"Nunca",0,"No dejo restos de alimentos",{"$f":"IF(W837=\"No dejo restos de alimentos\",(0),IF(W837=\"Un cuarto del plato\",(0.25*0.5*0.8312*30),IF(W837=\"La mitad del plato\",(0.5*0.5*0.8312*30),IF(W837=\"Tres cuartos del plato\",(0.75*0.5*0.8312*30)))))","v":0},0,0,0,0]
[null,null,null,null,null,"Calentador a Gas",null,null,0,"Tecnología solar ",null,null,null,null,0,null,0," En transmilenio",null,0,"Nunca",0,"No dejo restos de alimentos",0,0,0,0,0]
[null,null,null,null,null,"Calentador a Gas",null,null,0,"Tecnología solar ",null,null,null,null,0,null,0," En transmilenio",null,0,"Nunca",0,"No dejo restos de alimentos",0,0,0,0,0]
[null,null,null,null,null,"Calentador a Gas",null,null,0,"Tecnología solar ",null,null,null,null,0,null,0," En transmilenio",null,0,"Nunca",0,"No dejo restos de alimentos",0,0,0,0,0]
[null,null,null,null,null,"Calentador a Gas",null,null,0,"Tecnología solar ",null,null,null,null,0,null,0," En transmilenio",null,0,"Nunca",0,"No dejo restos de alimentos",0,0,0,0,0]
[null,null,null,null,null,"Calentador a Gas",null,null,0,"Tecnología solar ",null,null,null,null,0,null,0," En transmilenio",null,0,"Nunca",0,"No dejo restos de alimentos",0,0,0,0,0]
[null,null,null,null,null,"Calentador a Gas",null,null,0,"Tecnología solar ",null,null,null,null,0,null,0," En transmilenio",null,0,"Nunca",0,"No dejo restos de alimentos",0,0,0,0,0]
[null,null,null,null,null,"Calentador a Gas",null,null,0,"Tecnología solar ",null,null,null,null,0,null,0," En transmilenio",null,0,"Nunca",0,"No dejo restos de alimentos",0,0,0,0,0]
[null,null,null,null,null,"Calentador a Gas",null,null,0,"Tecnología solar ",null,null,null,null,0,null,0," En transmilenio",null,0,"Nunca",0,"No dejo restos de alimentos",0,0,0,0,0]
[null,null,null,null,null,"Calentador a Gas",null,null,0,"Tecnología solar ",null,null,null,null,0,null,0," En transmilenio",null,0,"Nunca",0,"No dejo restos de alimentos",0,0,0,0,0]
[null,null,null,null,null,"Calentador a Gas",null,null,0,"Tecnología solar ",null,null,null,null,0,null,0," En transmilenio",null,0,"Nunca",0,"No dejo restos de alimentos",0,0,0,0,0]
[null,null,null,null,null,"Calentador a Gas",null,null,0,"Tecnología solar ",null,null,null,null,0,null,0," En transmilenio",null,0,"Nunca",0,"No dejo restos de alimentos",0,0,0,0,0]
[null,null,null,null,null,"Calentador a Gas",null,null,0,"Tecnología solar ",null,null,null,null,0,null,0," En transmilenio",null,0,"Nunca",0,"No dejo restos de alimentos",0,0,0,0,0]
[null,null,null,null,null,"Calentador a Gas",null,null,0,"Tecnología solar ",null,null,null,null,0,null,0," En transmilenio",null,0,"Nunca",0,"No dejo restos de alimentos",0,0,0,0,0]
[null,null,null,null,null,"Calentador a Gas",null,null,0,"Tecnología solar ",null,null,null,null,0,null,0," En transmilenio",null,0,"Nunca",0,"No dejo restos de alimentos",0,0,0,0,0]
[null,null,null,null,null,"Calentador a Gas",null,null,0,"Tecnología solar ",null,null,null,null,0,null,0," En transmilenio",null,0,"Nunca",0,"No dejo restos de alimentos",0,0,0,0,0]
[null,null,null,null,null,"Calentador a Gas",null,null,0,"Tecnología solar ",null,null,null,null,0,null,0," En transmilenio",null,0,"Nunca",0,"No dejo restos de alimentos",0,0,0,0,0]
[null,null,null,null,null,"Calentador a Gas",null,null,0,"Tecnología solar ",null,null,null,null,0,null,0," En transmilenio",null,0,"Nunca",0,"No dejo restos de alimentos",0,0,0,0,0]
[null,null,null,null,null,"Calentador a Gas",null,null,0,"Tecnología solar ",null,null,null,null,0,null,0," En transmilenio",null,0,"Nunca",0,"No dejo restos de alimentos",0,0,0,0,0]
[null,null,null,null,null,"Calentador a Gas",null,null,0,"Tecnología solar ",null,null,null,null,0,null,0," En transmilenio",null,0,"Nunca",0,"No dejo restos de alimentos",0,0,0,0,0]
[null,null,null,null,null,"Calentador a Gas",null,null,0,"Tecnología solar ",null,null,null,null,0,null,0," En transmilenio",null,0,"Nunca",0,"No dejo restos de alimentos",0,0,0,0,0]
[null,null,null,null,null,"Calentador a Gas",null,null,0,"Tecnología solar ",null,null,null,null,0,null,0," En transmilenio",null,0,"Nunca",0,"No dejo restos de alimentos",0,0,0,0,0]
[null,null,null,null,null,"Calentador a Gas",null,null,0,"Tecnología solar ",null,null,null,null,0,null,0," En transmilenio",null,0,"Nunca",0,"No dejo restos de alimentos",0,0,0,0,0]
[null,null,null,null,null,"Calentador a Gas",null,null,0,"Tecnología solar ",null,null,null,null,0,null,0," En transmilenio",null,0,"Nunca",0,"No dejo restos de alimentos",0,0,0,0,0]
[null,null,null,null,null,"Calentador a Gas",null,null,0,"Tecnología solar ",null,null,null,null,0,null,0," En transmilenio",null,0,"Nunca",0,"No dejo restos de alimentos",0,0,0,0,0]
[null,null,null,null,null,"Calentador a Gas",null,null,0,"Tecnología solar ",null,null,null,null,0,null,0," En transmilenio",null,0,"Nunca",0,"No dejo restos de alimentos",0,0,0,0,0]
[null,null,null,null,null,"Calentador a Gas",null,null,0,"Tecnología solar ",null,null,null,null,0,null,0," En transmilenio",null,0,"Nunca",0,"No dejo restos de alimentos",0,0,0,0,0]
[null,null,null,null,null,"Calentador a Gas",null,null,0,"Tecnología solar ",null,null,null,null,0,null,0," En transmilenio",null,0,"Nunca",0,"No dejo restos de alimentos",0,0,0,0,0]
[null,null,null,null,null,"Calentador a Gas",null,null,0,"Tecnología solar ",null,null,null,null,0,null,0," En transmilenio",null,0,"Nunca",0,"No dejo restos de alimentos",0,0,0,0,0]
[null,null,null,null,null,"Calentador a Gas",null,null,0,"Tecnología solar ",null,null,null,null,0,null,0," En transmilenio",null,0,"Nunca",0,"No dejo restos de alimentos",0,0,0,0,0]
[null,null,null,null,null,"Calentador a Gas",null,null,0,"Tecnología solar ",null,null,null,null,0,null,0," En transmilenio",null,0,"Nunca",0,"No dejo restos de alimentos",0,0,0,0,0]
[null,null,null,null,null,"Calentador a Gas",null,null,0,"Tecnología solar ",null,null,null,null,0,null,0," En transmilenio",null,0,"Nunca",0,"No dejo restos de alimentos",0,0,0,0,0]
[null,null,null,null,null,"Calentador a Gas",null,null,0,"Tecnología solar ",null,null,null,null,0,null,0," En transmilenio",null,0,"Nunca",0,"No dejo restos de alimentos",0,0,0,0,0]
[null,null,null,null,null,"Calentador a Gas",null,null,0,"Tecnología solar ",null,null,null,null,0,null,0," En transmilenio",null,0,"Nunca",0,"No dejo restos de alimentos",0,0,0,0,0]
[null,null,null,null,null,"Calentador a Gas",null,null,0,"Tecnología solar ",null,null,null,null,0,null,0," En transmilenio",null,0,"Nunca",0,"No dejo restos de alimentos",0,0,0,0,0]
[null,null,null,null,null,"Calentador a Gas",null,null,0,"Tecnología solar ",null,null,null,null,0,null,0," En transmilenio",null,0,"Nunca",0,"No dejo restos de alimentos",0,0,0,0,0]
[null,null,null,null,null,"Calentador a Gas",null,null,0,"Tecnología solar ",null,null,null,null,0,null,0," En transmilenio",null,0,"Nunca",0,"No dejo restos de alimentos",0,0,0,0,0]
[null,null,null,null,null,"Calentador a Gas",null,null,0,"Tecnología solar ",null,null,null,null,0,null,0," En transmilenio",null,0,"Nunca",0,"No dejo restos de alimentos",0,0,0,0,0]
[null,null,null,null,null,"Calentador a Gas",null,null,0,"Tecnología solar ",null,null,null,null,0,null,0," En transmilenio",null,0,"Nunca",0,"No dejo restos de alimentos",0,0,0,0,0]
[null,null,null,null,null,"Calentador a Gas",null,null,0,"Tecnología solar ",null,null,null,null,0,null,0," En transmilenio",null,0,"Nunca",0,"No dejo restos de alimentos",0,0,0,0,0]
[null,null,null,null,null,"Calentador a Gas",null,null,0,"Tecnología solar ",null,null,null,null,0,null,0," En transmilenio",null,0,"Nunca",0,"No dejo restos de alimentos",0,0,0,0,0]
[null,null,null,null,null,"Calentador a Gas",null,null,0,"Tecnología solar ",null,null,null,null,0,null,0," En transmilenio",null,0,"Nunca",0,"No dejo restos de alimentos",0,0,0,0,0]
[null,null,null,null,null,"Calentador a Gas",null,null,0,"Tecnología solar ",null,null,null,null,0,null,0," En transmilenio",null,0,"Nunca",0,"No dejo restos de alimentos",0,0,0,0,0]
[null,null,null,null,null,"Calentador a Gas",null,null,0,"Tecnología solar ",null,null,null,null,0,null,0," En transmilenio",null,0,"Nunca",0,"No dejo restos de alimentos",0,0,0,0,0]
[null,null,null,null,null,"Calentador a Gas",null,null,0,"Tecnología solar ",null,null,null,null,0,null,0," En transmilenio",null,0,"Nunca",0,"No dejo restos de alimentos",0,0,0,0,0]
[null,null,null,null,null,"Calentador a Gas",null,null,0,"Tecnología solar ",null,null,null,null,0,null,0," En transmilenio",null,0,"Nunca",0,"No dejo restos de alimentos",0,0,0,0,0]
[null,null,null,null,null,"Calentador a Gas",null,null,0,"Tecnología solar ",null,null,null,null,0,null,0," En transmilenio",null,0,"Nunca",0,"No dejo restos de alimentos",0,0,0,0,0]
[null,null,null,null,null,"Calentador a Gas",null,null,0,"Tecnología solar ",null,null,null,null,0,null,0," En transmilenio",null,0,"Nunca",0,"No dejo restos de alimentos",0,0,0,0,0]
[null,null,null,null,null,"Calentador a Gas",null,null,0,"Tecnología solar ",null,null,null,null,0,null,0," En transmilenio",null,0,"Nunca",0,"No dejo restos de alimentos",0,0,0,0,0]
[null,null,null,null,null,"Calentador a Gas",null,null,0,"Tecnología solar ",null,null,null,null,0,null,0," En transmilenio",null,0,"Nunca",0,"No dejo restos de alimentos",0,0,0,0,0]
[null,null,null,null,null,"Calentador a Gas",null,null,0,"Tecnología solar ",null,null,null,null,0,null,0," En transmilenio",null,0,"Nunca",0,"No dejo restos de alimentos",0,0,0,0,0]
[null,null,null,null,null,"Calentador a Gas",null,null,0,"Tecnología solar ",null,null,null,null,0,null,0," En transmilenio",null,0,"Nunca",0,"No dejo restos de alimentos",0,0,0,0,0]
[null,null,null,null,null,"Calentador a Gas",null,null,0,"Tecnología solar ",null,null,null,null,0,null,0," En transmilenio",null,0,"Nunca",0,"No dejo restos de alimentos",0,0,0,0,0]
[null,null,null,null,null,"Calentador a Gas",null,null,0,"Tecnología solar ",null,null,null,null,0,null,0," En transmilenio",null,0,"Nunca",0,"No dejo restos de alimentos",0,0,0,0,0]
[null,null,null,null,null,"Calentador a Gas",null,null,0,"Tecnología solar ",null,null,null,null,0,null,0," En transmilenio",null,0,"Nunca",0,"No dejo restos de alimentos",0,0,0,0,0]
[null,null,null,null,null,"Calentador a Gas",null,null,0,"Tecnología solar ",null,null,null,null,0,null,0," En transmilenio",null,0,"Nunca",0,"No dejo restos de alimentos",0,0,0,0,0]
[null,null,null,null,null,"Calentador a Gas",null,null,0,"Tecnología solar ",null,null,null,null,0,null,0," En transmilenio",null,0,"Nunca",0,"No dejo restos de alimentos",0,0,0,0,0]
[null,null,null,null,null,"Calentador a Gas",null,null,0,"Tecnología solar ",null,null,null,null,0,null,0," En transmilenio",null,0,"Nunca",0,"No dejo restos de alimentos",0,0,0,0,0]
[null,null,null,null,null,"Calentador a Gas",null,null,0,"Tecnología solar ",null,null,null,null,0,null,0," En transmilenio",null,0,"Nunca",0,"No dejo restos de alimentos",0,0,0,0,0]
[null,null,null,null,null,"Calentador a Gas",null,null,0,"Tecnología solar ",null,null,null,null,0,null,0," En transmilenio",null,0,"Nunca",0,"No dejo restos de alimentos",0,0,0,0,0]
[null,null,null,null,null,"Calentador a Gas",null,null,0,"Tecnología solar ",null,null,null,null,0,null,0," En transmilenio",null,0,"Nunca",0,"No dejo restos de alimentos",0,0,0,0,0]
[null,null,null,null,null,"Calentador a Gas",null,null,0,"Tecnología solar ",null,null,null,null,0,null,0," En transmilenio",null,0,"Nunca",{"$f":"IF(U898=\"Nunca\",0,IF(U898=\"3 veces por semana\",\"513\",IF(U898=\"5 veces por semana\",855,IF(U898=\"Todos los días\",1197))))","v":0},"No dejo restos de alimentos",0,0,0,0,0]
[null,null,null,null,null,"Calentador a Gas",null,null,{"$f":"IF(F899=\"Calentador a Gas\",(H899*1.6*1.98*30),IF(F899=\"Calentador Eléctrico\",(H899*1.3*0.199*30),IF(F899=\"Ducha Eléctrica\",(H899*4*0.199*30),IF(F899=\"Ninguno\",\"0\"))))","v":0},"Tecnología solar ",null,null,null,null,{"$f":"IF(J899=\"Ahorradores \",(K899*0.02*5*0.199*30),IF(J899=\"Incandescentes \",(M899*0.1*5*0.199*30),IF(J899=\"LED\",(L899*0.007*5*0.199*30),IF(J899=\"Tecnología solar \",(N899*0)))))","v":0},null,{"$f":"P899*9*0.8312","v":0}," En transmilenio",null,{"$f":"IF(R899=\"En bicicleta\",(0*S899),IF(R899=\"En carro\",(0.218 *S899),IF(R899=\"En bus o SITP \",((0.78703*S899)/40),IF(R899=\" En transmilenio\",((0.68516*S899)/140)))))","v":0},"Nunca",0,"No dejo restos de alimentos",0,{"$f":"V899+T899+Q899+O899+I899+X899","v":0},{"$f":"Y899/1000","v":0},{"$f":"Y899*12","v":0},0]
[null,null,null,null,null,"Calentador a Gas",null,null,0,"Tecnología solar ",null,null,null,null,0,null,0," En transmilenio",null,0,"Nunca",0,"No dejo restos de alimentos",0,0,0,0,0]
[null,null,null,null,null,"Calentador a Gas",null,null,0,"Tecnología solar ",null,null,null,null,0,null,0," En transmilenio",null,0,"Nunca",0,"No dejo restos de alimentos",{"$f":"IF(W901=\"No dejo restos de alimentos\",(0),IF(W901=\"Un cuarto del plato\",(0.25*0.5*0.8312*30),IF(W901=\"La mitad del plato\",(0.5*0.5*0.8312*30),IF(W901=\"Tres cuartos del plato\",(0.75*0.5*0.8312*30)))))","v":0},0,0,0,0]
[null,null,null,null,null,"Calentador a Gas",null,null,0,"Tecnología solar ",null,null,null,null,0,null,0," En transmilenio",null,0,"Nunca",0,"No dejo restos de alimentos",0,0,0,0,0]
[null,null,null,null,null,"Calentador a Gas",null,null,0,"Tecnología solar ",null,null,null,null,0,null,0," En transmilenio",null,0,"Nunca",0,"No dejo restos de alimentos",0,0,0,0,0]
[null,null,null,null,null,"Calentador a Gas",null,null,0,"Tecnología solar ",null,null,null,null,0,null,0," En transmilenio",null,0,"Nunca",0,"No dejo restos de alimentos",0,0,0,0,0]
[null,null,null,null,null,"Calentador a Gas",null,null,0,"Tecnología solar ",null,null,null,null,0,null,0," En transmilenio",null,0,"Nunca",0,"No dejo restos de alimentos",0,0,0,0,0]
[null,null,null,null,null,"Calentador a Gas",null,null,0,"Tecnología solar ",null,null,null,null,0,null,0," En transmilenio",null,0,"Nunca",0,"No dejo restos de alimentos",0,0,0,0,0]
[null,null,null,null,null,"Calentador a Gas",null,null,0,"Tecnología solar ",null,null,null,null,0,null,0," En transmilenio",null,0,"Nunca",0,"No dejo restos de alimentos",0,0,0,0,0]
[null,null,null,null,null,"Calentador a Gas",null,null,0,"Tecnología solar ",null,null,null,null,0,null,0," En transmilenio",null,0,"Nunca",0,"No dejo restos de alimentos",0,0,0,0,0]
[null,null,null,null,null,"Calentador a Gas",null,null,0,"Tecnología solar ",null,null,null,null,0,null,0," En transmilenio",null,0,"Nunca",0,"No dejo restos de alimentos",0,0,0,0,0]
[null,null,null,null,null,"Calentador a Gas",null,null,0,"Tecnología solar ",null,null,null,null,0,null,0," En transmilenio",null,0,"Nunca",0,"No dejo restos de alimentos",0,0,0,0,0]
[null,null,null,null,null,"Calentador a Gas",null,null,0,"Tecnología solar ",null,null,null,null,0,null,0," En transmilenio",null,0,"Nunca",0,"No dejo restos de alimentos",0,0,0,0,0]
[null,null,null,null,null,"Calentador a Gas",null,null,0,"Tecnología solar ",null,null,null,null,0,null,0," En transmilenio",null,0,"Nunca",0,"No dejo restos de alimentos",0,0,0,0,0]
[null,null,null,null,null,"Calentador a Gas",null,null,0,"Tecnología solar ",null,null,null,null,0,null,0," En transmilenio",null,0,"Nunca",0,"No dejo restos de alimentos",0,0,0,0,0]
[null,null,null,null,null,"Calentador a Gas",null,null,0,"Tecnología solar ",null,null,null,null,0,null,0," En transmilenio",null,0,"Nunca",0,"No dejo restos de alimentos",0,0,0,0,0]
[null,null,null,null,null,"Calentador a Gas",null,null,0,"Tecnología solar ",null,null,null,null,0,null,0," En transmilenio",null,0,"Nunca",0,"No dejo restos de alimentos",0,0,0,0,0]
[null,null,null,null,null,"Calentador a Gas",null,null,0,"Tecnología solar ",null,null,null,null,0,null,0," En transmilenio",null,0,"Nunca",0,"No dejo restos de alimentos",0,0,0,0,0]
[null,null,null,null,null,"Calentador a Gas",null,null,0,"Tecnología solar ",null,null,null,null,0,null,0," En transmilenio",null,0,"Nunca",0,"No dejo restos de alimentos",0,0,0,0,0]
[null,null,null,null,null,"Calentador a Gas",null,null,0,"Tecnología solar ",null,null,null,null,0,null,0," En transmilenio",null,0,"Nunca",0,"No dejo restos de alimentos",0,0,0,0,0]
[null,null,null,null,null,"Calentador a Gas",null,null,0,"Tecnología solar ",null,null,null,null,0,null,0," En transmilenio",null,0,"Nunca",0,"No dejo restos de alimentos",0,0,0,0,0]
[null,null,null,null,null,"Calentador a Gas",null,null,0,"Tecnología solar ",null,null,null,null,0,null,0," En transmilenio",null,0,"Nunca",0,"No dejo restos de alimentos",0,0,0,0,0]
[null,null,null,null,null,"Calentador a Gas",null,null,0,"Tecnología solar ",null,null,null,null,0,null,0," En transmilenio",null,0,"Nunca",0,"No dejo restos de alimentos",0,0,0,0,0]
[null,null,null,null,null,"Calentador a Gas",null,null,0,"Tecnología solar ",null,null,null,null,0,null,0," En transmilenio",null,0,"Nunca",0,"No dejo restos de alimentos",0,0,0,0,0]
[null,null,null,null,null,"Calentador a Gas",null,null,0,"Tecnología solar ",null,null,null,null,0,null,0," En transmilenio",null,0,"Nunca",0,"No dejo restos de alimentos",0,0,0,0,0]
[null,null,null,null,null,"Calentador a Gas",null,null,0,"Tecnología solar ",null,null,null,null,0,null,0," En transmilenio",null,0,"Nunca",0,"No dejo restos de alimentos",0,0,0,0,0]
[null,null,null,null,null,"Calentador a Gas",null,null,0,"Tecnología solar ",null,null,null,null,0,null,0," En transmilenio",null,0,"Nunca",0,"No dejo restos de alimentos",0,0,0,0,0]
[null,null,null,null,null,"Calentador a Gas",null,null,0,"Tecnología solar ",null,null,null,null,0,null,0," En transmilenio",null,0,"Nunca",0,"No dejo restos de alimentos",0,0,0,0,0]
[null,null,null,null,null,"Calentador a Gas",null,null,0,"Tecnología solar ",null,null,null,null,0,null,0," En transmilenio",null,0,"Nunca",0,"No dejo restos de alimentos",0,0,0,0,0]
[null,null,null,null,null,"Calentador a Gas",null,null,0,"Tecnología solar ",null,null,null,null,0,null,0," En transmilenio",null,0,"Nunca",0,"No dejo restos de alimentos",0,0,0,0,0]
[null,null,null,null,null,"Calentador a Gas",null,null,0,"Tecnología solar ",null,null,null,null,0,null,0," En transmilenio",null,0,"Nunca",0,"No dejo restos de alimentos",0,0,0,0,0]
[null,null,null,null,null,"Calentador a Gas",null,null,0,"Tecnología solar ",null,null,null,null,0,null,0," En transmilenio",null,0,"Nunca",0,"No dejo restos de alimentos",0,0,0,0,0]
[null,null,null,null,null,"Calentador a Gas",null,null,0,"Tecnología solar ",null,null,null,null,0,null,0," En transmilenio",null,0,"Nunca",0,"No dejo restos de alimentos",0,0,0,0,0]
[null,null,null,null,null,"Calentador a Gas",null,null,0,"Tecnología solar ",null,null,null,null,0,null,0," En transmilenio",null,0,"Nunca",0,"No dejo restos de alimentos",0,0,0,0,0]
[null,null,null,null,null,"Calentador a Gas",null,null,0,"Tecnología solar ",null,null,null,null,0,null,0," En transmilenio",null,0,"Nunca",0,"No dejo restos de alimentos",0,0,0,0,0]
[null,null,null,null,null,"Calentador a Gas",null,null,0,"Tecnología solar ",null,null,null,null,0,null,0," En transmilenio",null,0,"Nunca",0,"No dejo restos de alimentos",0,0,0,0,0]
[null,null,null,null,null,"Calentador a Gas",null,null,0,"Tecnología solar ",null,null,null,null,0,null,0," En transmilenio",null,0,"Nunca",0,"No dejo restos de alimentos",0,0,0,0,0]
[null,null,null,null,null,"Calentador a Gas",null,null,0,"Tecnología solar ",null,null,null,null,0,null,0," En transmilenio",null,0,"Nunca",0,"No dejo restos de alimentos",0,0,0,0,0]
[null,null,null,null,null,"Calentador a Gas",null,null,0,"Tecnología solar ",null,null,null,null,0,null,0," En transmilenio",null,0,"Nunca",0,"No dejo restos de alimentos",0,0,0,0,0]
[null,null,null,null,null,"Calentador a Gas",null,null,0,"Tecnología solar ",null,null,null,null,0,null,0," En transmilenio",null,0,"Nunca",0,"No dejo restos de alimentos",0,0,0,0,0]
[null,null,null,null,null,"Calentador a Gas",null,null,0,"Tecnología solar ",null,null,null,null,0,null,0," En transmilenio",null,0,"Nunca",0,"No dejo restos de alimentos",0,0,0,0,0]
[null,null,null,null,null,"Calentador a Gas",null,null,0,"Tecnología solar ",null,null,null,null,0,null,0," En transmilenio",null,0,"Nunca",0,"No dejo restos de alimentos",0,0,0,0,0]
[null,null,null,null,null,"Calentador a Gas",null,null,0,"Tecnología solar ",null,null,null,null,0,null,0," En transmilenio",null,0,"Nunca",0,"No dejo restos de alimentos",0,0,0,0,0]
[null,null,null,null,null,"Calentador a Gas",null,null,0,"Tecnología solar ",null,null,null,null,0,null,0," En transmilenio",null,0,"Nunca",0,"No dejo restos de alimentos",0,0,0,0,0]
[null,null,null,null,null,"Calentador a Gas",null,null,0,"Tecnología solar ",null,null,null,null,0,null,0," En transmilenio",null,0,"Nunca",0,"No dejo restos de alimentos",0,0,0,0,0]
[null,null,null,null,null,"Calentador a Gas",null,null,0,"Tecnología solar ",null,null,null,null,0,null,0," En transmilenio",null,0,"Nunca",0,"No dejo restos de alimentos",0,0,0,0,0]
[null,null,null,null,null,"Calentador a Gas",null,null,0,"Tecnología solar ",null,null,null,null,0,null,0," En transmilenio",null,0,"Nunca",0,"No dejo restos de alimentos",0,0,0,0,0]
[null,null,null,null,null,"Calentador a Gas",null,null,0,"Tecnología solar ",null,null,null,null,0,null,0," En transmilenio",null,0,"Nunca",0,"No dejo restos de alimentos",0,0,0,0,0]
[null,null,null,null,null,"Calentador a Gas",null,null,0,"Tecnología solar ",null,null,null,null,0,null,0," En transmilenio",null,0,"Nunca",0,"No dejo restos de alimentos",0,0,0,0,0]
[null,null,null,null,null,"Calentador a Gas",null,null,0,"Tecnología solar ",null,null,null,null,0,null,0," En transmilenio",null,0,"Nunca",0,"No dejo restos de alimentos",0,0,0,0,0]
[null,null,null,null,null,"Calentador a Gas",null,null,0,"Tecnología solar ",null,null,null,null,0,null,0," En transmilenio",null,0,"Nunca",0,"No dejo restos de alimentos",0,0,0,0,0]
[null,null,null,null,null,"Calentador a Gas",null,null,0,"Tecnología solar ",null,null,null,null,0,null,0," En transmilenio",null,0,"Nunca",0,"No dejo restos de alimentos",0,0,0,0,0]
[null,null,null,null,null,"Calentador a Gas",null,null,0,"Tecnología solar ",null,null,null,null,0,null,0," En transmilenio",null,0,"Nunca",0,"No dejo restos de alimentos",0,0,0,0,0]
[null,null,null,null,null,"Calentador a Gas",null,null,0,"Tecnología solar ",null,null,null,null,0,null,0," En transmilenio",null,0,"Nunca",0,"No dejo restos de alimentos",0,0,0,0,0]
[null,null,null,null,null,"Calentador a Gas",null,null,0,"Tecnología solar ",null,null,null,null,0,null,0," En transmilenio",null,0,"Nunca",0,"No dejo restos de alimentos",0,0,0,0,0]
[null,null,null,null,null,"Calentador a Gas",null,null,0,"Tecnología solar ",null,null,null,null,0,null,0," En transmilenio",null,0,"Nunca",0,"No dejo restos de alimentos",0,0,0,0,0]
[null,null,null,null,null,"Calentador a Gas",null,null,0,"Tecnología solar ",null,null,null,null,0,null,0," En transmilenio",null,0,"Nunca",0,"No dejo restos de alimentos",0,0,0,0,0]
[null,null,null,null,null,"Calentador a Gas",null,null,0,"Tecnología solar ",null,null,null,null,0,null,0," En transmilenio",null,0,"Nunca",0,"No dejo restos de alimentos",0,0,0,0,0]
[null,null,null,null,null,"Calentador a Gas",null,null,0,"Tecnología solar ",null,null,null,null,0,null,0," En transmilenio",null,0,"Nunca",0,"No dejo restos de alimentos",0,0,0,0,0]
[null,null,null,null,null,"Calentador a Gas",null,null,0,"Tecnología solar ",null,null,null,null,0,null,0," En transmilenio",null,0,"Nunca",0,"No dejo restos de alimentos",0,0,0,0,0]
[null,null,null,null,null,"Calentador a Gas",null,null,0,"Tecnología solar ",null,null,null,null,0,null,0," En transmilenio",null,0,"Nunca",0,"No dejo restos de alimentos",0,0,0,0,0]
[null,null,null,null,null,"Calentador a Gas",null,null,0,"Tecnología solar ",null,null,null,null,0,null,0," En transmilenio",null,0,"Nunca",0,"No dejo restos de alimentos",0,0,0,0,0]
[null,null,null,null,null,"Calentador a Gas",null,null,0,"Tecnología solar ",null,null,null,null,0,null,0," En transmilenio",null,0,"Nunca",0,"No dejo restos de alimentos",0,0,0,0,0]
[null,null,null,null,null,"Calentador a Gas",null,null,0,"Tecnología solar ",null,null,null,null,0,null,0," En transmilenio",null,0,"Nunca",{"$f":"IF(U962=\"Nunca\",0,IF(U962=\"3 veces por semana\",\"513\",IF(U962=\"5 veces por semana\",855,IF(U962=\"Todos los días\",1197))))","v":0},"No dejo restos de alimentos",0,0,0,0,0]
[null,null,null,null,null,"Calentador a Gas",null,null,{"$f":"IF(F963=\"Calentador a Gas\",(H963*1.6*1.98*30),IF(F963=\"Calentador Eléctrico\",(H963*1.3*0.199*30),IF(F963=\"Ducha Eléctrica\",(H963*4*0.199*30),IF(F963=\"Ninguno\",\"0\"))))","v":0},"Tecnología solar ",null,null,null,null,{"$f":"IF(J963=\"Ahorradores \",(K963*0.02*5*0.199*30),IF(J963=\"Incandescentes \",(M963*0.1*5*0.199*30),IF(J963=\"LED\",(L963*0.007*5*0.199*30),IF(J963=\"Tecnología solar \",(N963*0)))))","v":0},null,{"$f":"P963*9*0.8312","v":0}," En transmilenio",null,{"$f":"IF(R963=\"En bicicleta\",(0*S963),IF(R963=\"En carro\",(0.218 *S963),IF(R963=\"En bus o SITP \",((0.78703*S963)/40),IF(R963=\" En transmilenio\",((0.68516*S963)/140)))))","v":0},"Nunca",0,"No dejo restos de alimentos",0,{"$f":"V963+T963+Q963+O963+I963+X963","v":0},{"$f":"Y963/1000","v":0},{"$f":"Y963*12","v":0},0]
[null,null,null,null,null,"Calentador a Gas",null,null,0,"Tecnología solar ",null,null,null,null,0,null,0," En transmilenio",null,0,"Nunca",0,"No dejo restos de alimentos",0,0,0,0,0]
[null,null,null,null,null,"Calentador a Gas",null,null,0,"Tecnología solar ",null,null,null,null,0,null,0," En transmilenio",null,0,"Nunca",0,"No dejo restos de alimentos",{"$f":"IF(W965=\"No dejo restos de alimentos\",(0),IF(W965=\"Un cuarto del plato\",(0.25*0.5*0.8312*30),IF(W965=\"La mitad del plato\",(0.5*0.5*0.8312*30),IF(W965=\"Tres cuartos del plato\",(0.75*0.5*0.8312*30)))))","v":0},0,0,0,0]
[null,null,null,null,null,"Calentador a Gas",null,null,0,"Tecnología solar ",null,null,null,null,0,null,0," En transmilenio",null,0,"Nunca",0,"No dejo restos de alimentos",0,0,0,0,0]
[null,null,null,null,null,"Calentador a Gas",null,null,0,"Tecnología solar ",null,null,null,null,0,null,0," En transmilenio",null,0,"Nunca",0,"No dejo restos de alimentos",0,0,0,0,0]
[null,null,null,null,null,"Calentador a Gas",null,null,0,"Tecnología solar ",null,null,null,null,0,null,0," En transmilenio",null,0,"Nunca",0,"No dejo restos de alimentos",0,0,0,0,0]
[null,null,null,null,null,"Calentador a Gas",null,null,0,"Tecnología solar ",null,null,null,null,0,null,0," En transmilenio",null,0,"Nunca",0,"No dejo restos de alimentos",0,0,0,0,0]
[null,null,null,null,null,"Calentador a Gas",null,null,0,"Tecnología solar ",null,null,null,null,0,null,0," En transmilenio",null,0,"Nunca",0,"No dejo restos de alimentos",0,0,0,0,0]
[null,null,null,null,null,"Calentador a Gas",null,null,0,"Tecnología solar ",null,null,null,null,0,null,0," En transmilenio",null,0,"Nunca",0,"No dejo restos de alimentos",0,0,0,0,0]
[null,null,null,null,null,"Calentador a Gas",null,null,0,"Tecnología solar ",null,null,null,null,0,null,0," En transmilenio",null,0,"Nunca",0,"No dejo restos de alimentos",0,0,0,0,0]
[null,null,null,null,null,"Calentador a Gas",null,null,0,"Tecnología solar ",null,null,null,null,0,null,0," En transmilenio",null,0,"Nunca",0,"No dejo restos de alimentos",0,0,0,0,0]
[null,null,null,null,null,"Calentador a Gas",null,null,0,"Tecnología solar ",null,null,null,null,0,null,0," En transmilenio",null,0,"Nunca",0,"No dejo restos de alimentos",0,0,0,0,0]
[null,null,null,null,null,"Calentador a Gas",null,null,0,"Tecnología solar ",null,null,null,null,0,null,0," En transmilenio",null,0,"Nunca",0,"No dejo restos de alimentos",0,0,0,0,0]
[null,null,null,null,null,"Calentador a Gas",null,null,0,"Tecnología solar ",null,null,null,null,0,null,0," En transmilenio",null,0,"Nunca",0,"No dejo restos de alimentos",0,0,0,0,0]
[null,null,null,null,null,"Calentador a Gas",null,null,0,"Tecnología solar ",null,null,null,null,0,null,0," En transmilenio",null,0,"Nunca",0,"No dejo restos de alimentos",0,0,0,0,0]
[null,null,null,null,null,"Calentador a Gas",null,null,0,"Tecnología solar ",null,null,null,null,0,null,0," En transmilenio",null,0,"Nunca",0,"No dejo restos de alimentos",0,0,0,0,0]
[null,null,null,null,null,"Calentador a Gas",null,null,0,"Tecnología solar ",null,null,null,null,0,null,0," En transmilenio",null,0,"Nunca",0,"No dejo restos de alimentos",0,0,0,0,0]
[null,null,null,null,null,"Calentador a Gas",null,null,0,"Tecnología solar ",null,null,null,null,0,null,0," En transmilenio",null,0,"Nunca",0,"No dejo restos de alimentos",0,0,0,0,0]
[null,null,null,null,null,"Calentador a Gas",null,null,0,"Tecnología solar ",null,null,null,null,0,null,0," En transmilenio",null,0,"Nunca",0,"No dejo restos de alimentos",0,0,0,0,0]
[null,null,null,null,null,"Calentador a Gas",null,null,0,"Tecnología solar ",null,null,null,null,0,null,0," En transmilenio",null,0,"Nunca",0,"No dejo restos de alimentos",0,0,0,0,0]
[null,null,null,null,null,"Calentador a Gas",null,null,0,"Tecnología solar ",null,null,null,null,0,null,0," En transmilenio",null,0,"Nunca",0,"No dejo restos de alimentos",0,0,0,0,0]
[null,null,null,null,null,"Calentador a Gas",null,null,0,"Tecnología solar ",null,null,null,null,0,null,0," En transmilenio",null,0,"Nunca",0,"No dejo restos de alimentos",0,0,0,0,0]
[null,null,null,null,null,"Calentador a Gas",null,null,0,"Tecnología solar ",null,null,null,null,0,null,0," En transmilenio",null,0,"Nunca",0,"No dejo restos de alimentos",0,0,0,0,0]
[null,null,null,null,null,"Calentador a Gas",null,null,0,"Tecnología solar ",null,null,null,null,0,null,0," En transmilenio",null,0,"Nunca",0,"No dejo restos de alimentos",0,0,0,0,0]
[null,null,null,null,null,"Calentador a Gas",null,null,0,"Tecnología solar ",null,null,null,null,0,null,0," En transmilenio",null,0,"Nunca",0,"No dejo restos de alimentos",0,0,0,0,0]
[null,null,null,null,null,"Calentador a Gas",null,null,0,"Tecnología solar ",null,null,null,null,0,null,0," En transmilenio",null,0,"Nunca",0,"No dejo restos de alimentos",0,0,0,0,0]
[null,null,null,null,null,"Calentador a Gas",null,null,0,"Tecnología solar ",null,null,null,null,0,null,0," En transmilenio",null,0,"Nunca",0,"No dejo restos de alimentos",0,0,0,0,0]
[null,null,null,null,null,"Calentador a Gas",null,null,0,"Tecnología solar ",null,null,null,null,0,null,0," En transmilenio",null,0,"Nunca",0,"No dejo restos de alimentos",0,0,0,0,0]
[null,null,null,null,null,"Calentador a Gas",null,null,0,"Tecnología solar ",null,null,null,null,0,null,0," En transmilenio",null,0,"Nunca",0,"No dejo restos de alimentos",0,0,0,0,0]
[null,null,null,null,null,"Calentador a Gas",null,null,0,"Tecnología solar ",null,null,null,null,0,null,0," En transmilenio",null,0,"Nunca",0,"No dejo restos de alimentos",0,0,0,0,0]
[null,null,null,null,null,"Calentador a Gas",null,null,0,"Tecnología solar ",null,null,null,null,0,null,0," En transmilenio",null,0,"Nunca",0,"No dejo restos de alimentos",0,0,0,0,0]
[null,null,null,null,null,"Calentador a Gas",null,null,0,"Tecnología solar ",null,null,null,null,0,null,0," En transmilenio",null,0,"Nunca",0,"No dejo restos de alimentos",0,0,0,0,0]
[null,null,null,null,null,"Calentador a Gas",null,null,0,"Tecnología solar ",null,null,null,null,0,null,0," En transmilenio",null,0,"Nunca",0,"No dejo restos de alimentos",0,0,0,0,0]
[null,null,null,null,null,"Calentador a Gas",null,null,0,"Tecnología solar ",null,null,null,null,0,null,0," En transmilenio",null,0,"Nunca",0,"No dejo restos de alimentos",0,0,0,0,0]
[null,null,null,null,null,"Calentador a Gas",null,null,0,"Tecnología solar ",null,null,null,null,0,null,0," En transmilenio",null,0,"Nunca",0,"No dejo restos de alimentos",0,0,0,0,0]
[null,null,null,null,null,"Calentador a Gas",null,null,0,"Tecnología solar ",null,null,null,null,0,null,0," En transmilenio",null,0,"Nunca",0,"No dejo restos de alimentos",0,0,0,0,0]
[null,null,null,null,null,"Calentador a Gas",null,null,0,"Tecnología solar ",null,null,null,null,0,null,0," En transmilenio",null,0,"Nunca",0,"No dejo restos de alimentos",0,0,0,0,0]
[null,null,null,null,null,"Calentador a Gas",null,null,0,"Tecnología solar ",null,null,null,null,0,null,0," En transmilenio",null,0,"Nunca",0,"No dejo restos de alimentos",0,0,0,0,0]
[null,null,null,null,null,"Calentador a Gas",null,null,0,"Tecnología solar ",null,null,null,null,0,null,0," En transmilenio",null,0,"Nunca",0,"No dejo restos de alimentos",0,0,0,0,0]
[null,null,null,null,null,"Calentador a Gas",null,null,0,"Tecnología solar ",null,null,null,null,0,null,0," En transmilenio",null,0,"Nunca",0,"No dejo restos de alimentos",0,0,0,0,0]
[null,null,null,null,null,"Calentador a Gas",null,null,0,"Tecnología solar ",null,null,null,null,0,null,0," En transmilenio",null,0,"Nunca",0,"No dejo restos de alimentos",0,0,0,0,0]
[null,null,null,null,null,"Calentador a Gas",null,null,0,"Tecnología solar ",null,null,null,null,0,null,0," En transmilenio",null,0,"Nunca",0,"No dejo restos de alimentos",0,0,0,0,0]
[null,null,null,null,null,"Calentador a Gas",null,null,0,"Tecnología solar ",null,null,null,null,0,null,0," En transmilenio",null,0,"Nunca",0,"No dejo restos de alimentos",0,0,0,0,0]
[null,null,null,null,null,"Calentador a Gas",null,null,0,"Tecnología solar ",null,null,null,null,0,null,0," En transmilenio",null,0,"Nunca",0,"No dejo restos de alimentos",0,0,0,0,0]
[null,null,null,null,null,"Calentador a Gas",null,null,0,"Tecnología solar ",null,null,null,null,0,null,0," En transmilenio",null,0,"Nunca",0,"No dejo restos de alimentos",0,0,0,0,0]
[null,null,null,null,null,"Calentador a Gas",null,null,0,"Tecnología solar ",null,null,null,null,0,null,0," En transmilenio",null,0,"Nunca",0,"No dejo restos de alimentos",0,0,0,0,0]
[null,null,null,null,null,"Calentador a Gas",null,null,0,"Tecnología solar ",null,null,null,null,0,null,0," En transmilenio",null,0,"Nunca",0,"No dejo restos de alimentos",0,0,0,0,0]
[null,null,null,null,null,"Calentador a Gas",null,null,0,"Tecnología solar ",null,null,null,null,0,null,0," En transmilenio",null,0,"Nunca",0,"No dejo restos de alimentos",0,0,0,0,0]
[null,null,null,null,null,"Calentador a Gas",null,null,0,"Tecnología solar ",null,null,null,null,0,null,0," En transmilenio",null,0,"Nunca",0,"No dejo restos de alimentos",0,0,0,0,0]
[null,null,null,null,null,"Calentador a Gas",null,null,0,"Tecnología solar ",null,null,null,null,0,null,0," En transmilenio",null,0,"Nunca",0,"No dejo restos de alimentos",0,0,0,0,0]
[null,null,null,null,null,"Calentador a Gas",null,null,0,"Tecnología solar ",null,null,null,null,0,null,0," En transmilenio",null,0,"Nunca",0,"No dejo restos de alimentos",0,0,0,0,0]
[null,null,null,null,null,"Calentador a Gas",null,null,0,"Tecnología solar ",null,null,null,null,0,null,0," En transmilenio",null,0,"Nunca",0,"No dejo restos de alimentos",0,0,0,0,0]
[null,null,null,null,null,"Calentador a Gas",null,null,0,"Tecnología solar ",null,null,null,null,0,null,0," En transmilenio",null,0,"Nunca",0,"No dejo restos de alimentos",0,0,0,0,0]
[null,null,null,null,null,"Calentador a Gas",null,null,0,"Tecnología solar ",null,null,null,null,0,null,0," En transmilenio",null,0,"Nunca",0,"No dejo restos de alimentos",0,0,0,0,0]
[null,null,null,null,null,"Calentador a Gas",null,null,0,"Tecnología solar ",null,null,null,null,0,null,0," En transmilenio",null,0,"Nunca",0,"No dejo restos de alimentos",0,0,0,0,0]
[null,null,null,null,null,"Calentador a Gas",null,null,0,"Tecnología solar ",null,null,null,null,0,null,0," En transmilenio",null,0,"Nunca",0,"No dejo restos de alimentos",0,0,0,0,0]
[null,null,null,null,null,"Calentador a Gas",null,null,0,"Tecnología solar ",null,null,null,null,0,null,0," En transmilenio",null,0,"Nunca",0,"No dejo restos de alimentos",0,0,0,0,0]
[null,null,null,null,null,"Calentador a Gas",null,null,0,"Tecnología solar ",null,null,null,null,0,null,0," En transmilenio",null,0,"Nunca",0,"No dejo restos de alimentos",0,0,0,0,0]
[null,null,null,null,null,"Calentador a Gas",null,null,0,"Tecnología solar ",null,null,null,null,0,null,0," En transmilenio",null,0,"Nunca",0,"No dejo restos de alimentos",0,0,0,0,0]
[null,null,null,null,null,"Calentador a Gas",null,null,0,"Tecnología solar ",null,null,null,null,0,null,0," En transmilenio",null,0,"Nunca",0,"No dejo restos de alimentos",0,0,0,0,0]
[null,null,null,null,null,"Calentador a Gas",null,null,0,"Tecnología solar ",null,null,null,null,0,null,0," En transmilenio",null,0,"Nunca",0,"No dejo restos de alimentos",0,0,0,0,0]
[null,null,null,null,null,"Calentador a Gas",null,null,0,"Tecnología solar ",null,null,null,null,0,null,0," En transmilenio",null,0,"Nunca",0,"No dejo restos de alimentos",0,0,0,0,0]
[null,null,null,null,null,"Calentador a Gas",null,null,0,"Tecnología solar ",null,null,null,null,0,null,0," En transmilenio",null,0,"Nunca",0,"No dejo restos de alimentos",0,0,0,0,0]
[null,null,null,null,null,"Calentador a Gas",null,null,0,"Tecnología solar ",null,null,null,null,0,null,0," En transmilenio",null,0,"Nunca",{"$f":"IF(U1026=\"Nunca\",0,IF(U1026=\"3 veces por semana\",\"513\",IF(U1026=\"5 veces por semana\",855,IF(U1026=\"Todos los días\",1197))))","v":0},"No dejo restos de alimentos",0,0,0,0,0]
[null,null,null,null,null,"Calentador a Gas",null,null,{"$f":"IF(F1027=\"Calentador a Gas\",(H1027*1.6*1.98*30),IF(F1027=\"Calentador Eléctrico\",(H1027*1.3*0.199*30),IF(F1027=\"Ducha Eléctrica\",(H1027*4*0.199*30),IF(F1027=\"Ninguno\",\"0\"))))","v":0},"Tecnología solar ",null,null,null,null,{"$f":"IF(J1027=\"Ahorradores \",(K1027*0.02*5*0.199*30),IF(J1027=\"Incandescentes \",(M1027*0.1*5*0.199*30),IF(J1027=\"LED\",(L1027*0.007*5*0.199*30),IF(J1027=\"Tecnología solar \",(N1027*0)))))","v":0},null,{"$f":"P1027*9*0.8312","v":0}," En transmilenio",null,{"$f":"IF(R1027=\"En bicicleta\",(0*S1027),IF(R1027=\"En carro\",(0.218 *S1027),IF(R1027=\"En bus o SITP \",((0.78703*S1027)/40),IF(R1027=\" En transmilenio\",((0.68516*S1027)/140)))))","v":0},"Nunca",0,"No dejo restos de alimentos",0,{"$f":"V1027+T1027+Q1027+O1027+I1027+X1027","v":0},{"$f":"Y1027/1000","v":0},{"$f":"Y1027*12","v":0},0]
[null,null,null,null,null,"Calentador a Gas",null,null,0,"Tecnología solar ",null,null,null,null,0,null,0," En transmilenio",null,0,"Nunca",0,"No dejo restos de alimentos",0,0,0,0,0]
[null,null,null,null,null,"Calentador a Gas",null,null,0,"Tecnología solar ",null,null,null,null,0,null,0," En transmilenio",null,0,"Nunca",0,"No dejo restos de alimentos",{"$f":"IF(W1029=\"No dejo restos de alimentos\",(0),IF(W1029=\"Un cuarto del plato\",(0.25*0.5*0.8312*30),IF(W1029=\"La mitad del plato\",(0.5*0.5*0.8312*30),IF(W1029=\"Tres cuartos del plato\",(0.75*0.5*0.8312*30)))))","v":0},0,0,0,0]
[null,null,null,null,null,"Calentador a Gas",null,null,0,"Tecnología solar ",null,null,null,null,0,null,0," En transmilenio",null,0,"Nunca",0,"No dejo restos de alimentos",0,0,0,0,0]
[null,null,null,null,null,"Calentador a Gas",null,null,0,"Tecnología solar ",null,null,null,null,0,null,0," En transmilenio",null,0,"Nunca",0,"No dejo restos de alimentos",0,0,0,0,0]
[null,null,null,null,null,"Calentador a Gas",null,null,0,"Tecnología solar ",null,null,null,null,0,null,0," En transmilenio",null,0,"Nunca",0,"No dejo restos de alimentos",0,0,0,0,0]
[null,null,null,null,null,"Calentador a Gas",null,null,0,"Tecnología solar ",null,null,null,null,0,null,0," En transmilenio",null,0,"Nunca",0,"No dejo restos de alimentos",0,0,0,0,0]
[null,null,null,null,null,"Calentador a Gas",null,null,0,"Tecnología solar ",null,null,null,null,0,null,0," En transmilenio",null,0,"Nunca",0,"No dejo restos de alimentos",0,0,0,0,0]
[null,null,null,null,null,"Calentador a Gas",null,null,0,"Tecnología solar ",null,null,null,null,0,null,0," En transmilenio",null,0,"Nunca",0,"No dejo restos de alimentos",0,0,0,0,0]
[null,null,null,null,null,"Calentador a Gas",null,null,0,"Tecnología solar ",null,null,null,null,0,null,0," En transmilenio",null,0,"Nunca",0,"No dejo restos de alimentos",0,0,0,0,0]
[null,null,null,null,null,"Calentador a Gas",null,null,0,"Tecnología solar ",null,null,null,null,0,null,0," En transmilenio",null,0,"Nunca",0,"No dejo restos de alimentos",0,0,0,0,0]
[null,null,null,null,null,"Calentador a Gas",null,null,0,"Tecnología solar ",null,null,null,null,0,null,0," En transmilenio",null,0,"Nunca",0,"No dejo restos de alimentos",0,0,0,0,0]
[null,null,null,null,null,"Calentador a Gas",null,null,0,"Tecnología solar ",null,null,null,null,0,null,0," En transmilenio",null,0,"Nunca",0,"No dejo restos de alimentos",0,0,0,0,0]
[null,null,null,null,null,"Calentador a Gas",null,null,0,"Tecnología solar ",null,null,null,null,0,null,0," En transmilenio",null,0,"Nunca",0,"No dejo restos de alimentos",0,0,0,0,0]
[null,null,null,null,null,"Calentador a Gas",null,null,0,"Tecnología solar ",null,null,null,null,0,null,0," En transmilenio",null,0,"Nunca",0,"No dejo restos de alimentos",0,0,0,0,0]
[null,null,null,null,null,"Calentador a Gas",null,null,0,"Tecnología solar ",null,null,null,null,0,null,0," En transmilenio",null,0,"Nunca",0,"No dejo restos de alimentos",0,0,0,0,0]
[null,null,null,null,null,"Calentador a Gas",null,null,0,"Tecnología solar ",null,null,null,null,0,null,0," En transmilenio",null,0,"Nunca",0,"No dejo restos de alimentos",0,0,0,0,0]
[null,null,null,null,null,"Calentador a Gas",null,null,0,"Tecnología solar ",null,null,null,null,0,null,0," En transmilenio",null,0,"Nunca",0,"No dejo restos de alimentos",0,0,0,0,0]
[null,null,null,null,null,"Calentador a Gas",null,null,0,"Tecnología solar ",null,null,null,null,0,null,0," En transmilenio",null,0,"Nunca",0,"No dejo restos de alimentos",0,0,0,0,0]
[null,null,null,null,null,"Calentador a Gas",null,null,0,"Tecnología solar ",null,null,null,null,0,null,0," En transmilenio",null,0,"Nunca",0,"No dejo restos de alimentos",0,0,0,0,0]
[null,null,null,null,null,"Calentador a Gas",null,null,0,"Tecnología solar ",null,null,null,null,0,null,0," En transmilenio",null,0,"Nunca",0,"No dejo restos de alimentos",0,0,0,0,0]
[null,null,null,null,null,"Calentador a Gas",null,null,0,"Tecnología solar ",null,null,null,null,0,null,0," En transmilenio",null,0,"Nunca",0,"No dejo restos de alimentos",0,0,0,0,0]
[null,null,null,null,null,"Calentador a Gas",null,null,0,"Tecnología solar ",null,null,null,null,0,null,0," En transmilenio",null,0,"Nunca",0,"No dejo restos de alimentos",0,0,0,0,0]
[null,null,null,null,null,"Calentador a Gas",null,null,0,"Tecnología solar ",null,null,null,null,0,null,0," En transmilenio",null,0,"Nunca",0,"No dejo restos de alimentos",0,0,0,0,0]
[null,null,null,null,null,"Calentador a Gas",null,null,0,"Tecnología solar ",null,null,null,null,0,null,0," En transmilenio",null,0,"Nunca",0,"No dejo restos de alimentos",0,0,0,0,0]
[null,null,null,null,null,"Calentador a Gas",null,null,0,"Tecnología solar ",null,null,null,null,0,null,0," En transmilenio",null,0,"Nunca",0,"No dejo restos de alimentos",0,0,0,0,0]
[null,null,null,null,null,"Calentador a Gas",null,null,0,"Tecnología solar ",null,null,null,null,0,null,0," En transmilenio",null,0,"Nunca",0,"No dejo restos de alimentos",0,0,0,0,0]
[null,null,null,null,null,"Calentador a Gas",null,null,0,"Tecnología solar ",null,null,null,null,0,null,0," En transmilenio",null,0,"Nunca",0,"No dejo restos de alimentos",0,0,0,0,0]
[null,null,null,null,null,"Calentador a Gas",null,null,0,"Tecnología solar ",null,null,null,null,0,null,0," En transmilenio",null,0,"Nunca",0,"No dejo restos de alimentos",0,0,0,0,0]
[null,null,null,null,null,"Calentador a Gas",null,null,0,"Tecnología solar ",null,null,null,null,0,null,0," En transmilenio",null,0,"Nunca",0,"No dejo restos de alimentos",0,0,0,0,0]
[null,null,null,null,null,"Calentador a Gas",null,null,0,"Tecnología solar ",null,null,null,null,0,null,0," En transmilenio",null,0,"Nunca",0,"No dejo restos de alimentos",0,0,0,0,0]
[null,null,null,null,null,"Calentador a Gas",null,null,0,"Tecnología solar ",null,null,null,null,0,null,0," En transmilenio",null,0,"Nunca",0,"No dejo restos de alimentos",0,0,0,0,0]
[null,null,null,null,null,"Calentador a Gas",null,null,0,"Tecnología solar ",null,null,null,null,0,null,0," En transmilenio",null,0,"Nunca",0,"No dejo restos de alimentos",0,0,0,0,0]
[null,null,null,null,null,"Calentador a Gas",null,null,0,"Tecnología solar ",null,null,null,null,0,null,0," En transmilenio",null,0,"Nunca",0,"No dejo restos de alimentos",0,0,0,0,0]
[null,null,null,null,null,"Calentador a Gas",null,null,0,"Tecnología solar ",null,null,null,null,0,null,0," En transmilenio",null,0,"Nunca",0,"No dejo restos de alimentos",0,0,0,0,0]
[null,null,null,null,null,"Calentador a Gas",null,null,0,"Tecnología solar ",null,null,null,null,0,null,0," En transmilenio",null,0,"Nunca",0,"No dejo restos de alimentos",0,0,0,0,0]
[null,null,null,null,null,"Calentador a Gas",null,null,0,"Tecnología solar ",null,null,null,null,0,null,0," En transmilenio",null,0,"Nunca",0,"No dejo restos de alimentos",0,0,0,0,0]
[null,null,null,null,null,"Calentador a Gas",null,null,0,"Tecnología solar ",null,null,null,null,0,null,0," En transmilenio",null,0,"Nunca",0,"No dejo restos de alimentos",0,0,0,0,0]
[null,null,null,null,null,"Calentador a Gas",null,null,0,"Tecnología solar ",null,null,null,null,0,null,0," En transmilenio",null,0,"Nunca",0,"No dejo restos de alimentos",0,0,0,0,0]
[null,null,null,null,null,"Calentador a Gas",null,null,0,"Tecnología solar ",null,null,null,null,0,null,0," En transmilenio",null,0,"Nunca",0,"No dejo restos de alimentos",0,0,0,0,0]
[null,null,null,null,null,"Calentador a Gas",null,null,0,"Tecnología solar ",null,null,null,null,0,null,0," En transmilenio",null,0,"Nunca",0,"No dejo restos de alimentos",0,0,0,0,0]
[null,null,null,null,null,"Calentador a Gas",null,null,0,"Tecnología solar ",null,null,null,null,0,null,0," En transmilenio",null,0,"Nunca",0,"No dejo restos de alimentos",0,0,0,0,0]
[null,null,null,null,null,"Calentador a Gas",null,null,0,"Tecnología solar ",null,null,null,null,0,null,0," En transmilenio",null,0,"Nunca",0,"No dejo restos de alimentos",0,0,0,0,0]
[null,null,null,null,null,"Calentador a Gas",null,null,0,"Tecnología solar ",null,null,null,null,0,null,0," En transmilenio",null,0,"Nunca",0,"No dejo restos de alimentos",0,0,0,0,0]
[null,null,null,null,null,"Calentador a Gas",null,null,0,"Tecnología solar ",null,null,null,null,0,null,0," En transmilenio",null,0,"Nunca",0,"No dejo restos de alimentos",0,0,0,0,0]
[null,null,null,null,null,"Calentador a Gas",null,null,0,"Tecnología solar ",null,null,null,null,0,null,0," En transmilenio",null,0,"Nunca",0,"No dejo restos de alimentos",0,0,0,0,0]
[null,null,null,null,null,"Calentador a Gas",null,null,0,"Tecnología solar ",null,null,null,null,0,null,0," En transmilenio",null,0,"Nunca",0,"No dejo restos de alimentos",0,0,0,0,0]
[null,null,null,null,null,"Calentador a Gas",null,null,0,"Tecnología solar ",null,null,null,null,0,null,0," En transmilenio",null,0,"Nunca",0,"No dejo restos de alimentos",0,0,0,0,0]
[null,null,null,null,null,"Calentador a Gas",null,null,0,"Tecnología solar ",null,null,null,null,0,null,0," En transmilenio",null,0,"Nunca",0,"No dejo restos de alimentos",0,0,0,0,0]
[null,null,null,null,null,"Calentador a Gas",null,null,0,"Tecnología solar ",null,null,null,null,0,null,0," En transmilenio",null,0,"Nunca",0,"No dejo restos de alimentos",0,0,0,0,0]
[null,null,null,null,null,"Calentador a Gas",null,null,0,"Tecnología solar ",null,null,null,null,0,null,0," En transmilenio",null,0,"Nunca",0,"No dejo restos de alimentos",0,0,0,0,0]
[null,null,null,null,null,"Calentador a Gas",null,null,0,"Tecnología solar ",null,null,null,null,0,null,0," En transmilenio",null,0,"Nunca",0,"No dejo restos de alimentos",0,0,0,0,0]
[null,null,null,null,null,"Calentador a Gas",null,null,0,"Tecnología solar ",null,null,null,null,0,null,0," En transmilenio",null,0,"Nunca",0,"No dejo restos de alimentos",0,0,0,0,0]
[null,null,null,null,null,"Calentador a Gas",null,null,0,"Tecnología solar ",null,null,null,null,0,null,0," En transmilenio",null,0,"Nunca",0,"No dejo restos de alimentos",0,0,0,0,0]
[null,null,null,null,null,"Calentador a Gas",null,null,0,"Tecnología solar ",null,null,null,null,0,null,0," En transmilenio",null,0,"Nunca",0,"No dejo restos de alimentos",0,0,0,0,0]
[null,null,null,null,null,"Calentador a Gas",null,null,0,"Tecnología solar ",null,null,null,null,0,null,0," En transmilenio",null,0,"Nunca",0,"No dejo restos de alimentos",0,0,0,0,0]
[null,null,null,null,null,"Calentador a Gas",null,null,0,"Tecnología solar ",null,null,null,null,0,null,0," En transmilenio",null,0,"Nunca",0,"No dejo restos de alimentos",0,0,0,0,0]
[null,null,null,null,null,"Calentador a Gas",null,null,0,"Tecnología solar ",null,null,null,null,0,null,0," En transmilenio",null,0,"Nunca",0,"No dejo restos de alimentos",0,0,0,0,0]
[null,null,null,null,null,"Calentador a Gas",null,null,0,"Tecnología solar ",null,null,null,null,0,null,0," En transmilenio",null,0,"Nunca",0,"No dejo restos de alimentos",0,0,0,0,0]
[null,null,null,null,null,"Calentador a Gas",null,null,0,"Tecnología solar ",null,null,null,null,0,null,0," En transmilenio",null,0,"Nunca",0,"No dejo restos de alimentos",0,0,0,0,0]
[null,null,null,null,null,"Calentador a Gas",null,null,0,"Tecnología solar ",null,null,null,null,0,null,0," En transmilenio",null,0,"Nunca",0,"No dejo restos de alimentos",0,0,0,0,0]
[null,null,null,null,null,"Calentador a Gas",null,null,0,"Tecnología solar ",null,null,null,null,0,null,0," En transmilenio",null,0,"Nunca",0,"No dejo restos de alimentos",0,0,0,0,0]
[null,null,null,null,null,"Calentador a Gas",null,null,0,"Tecnología solar ",null,null,null,null,0,null,0," En transmilenio",null,0,"Nunca",0,"No dejo restos de alimentos",0,0,0,0,0]
[null,null,null,null,null,"Calentador a Gas",null,null,0,"Tecnología solar ",null,null,null,null,0,null,0," En transmilenio",null,0,"Nunca",{"$f":"IF(U1090=\"Nunca\",0,IF(U1090=\"3 veces por semana\",\"513\",IF(U1090=\"5 veces por semana\",855,IF(U1090=\"Todos los días\",1197))))","v":0},"No dejo restos de alimentos",0,0,0,0,0]
[null,null,null,null,null,"Calentador a Gas",null,null,{"$f":"IF(F1091=\"Calentador a Gas\",(H1091*1.6*1.98*30),IF(F1091=\"Calentador Eléctrico\",(H1091*1.3*0.199*30),IF(F1091=\"Ducha Eléctrica\",(H1091*4*0.199*30),IF(F1091=\"Ninguno\",\"0\"))))","v":0},"Tecnología solar ",null,null,null,null,{"$f":"IF(J1091=\"Ahorradores \",(K1091*0.02*5*0.199*30),IF(J1091=\"Incandescentes \",(M1091*0.1*5*0.199*30),IF(J1091=\"LED\",(L1091*0.007*5*0.199*30),IF(J1091=\"Tecnología solar \",(N1091*0)))))","v":0},null,{"$f":"P1091*9*0.8312","v":0}," En transmilenio",null,{"$f":"IF(R1091=\"En bicicleta\",(0*S1091),IF(R1091=\"En carro\",(0.218 *S1091),IF(R1091=\"En bus o SITP \",((0.78703*S1091)/40),IF(R1091=\" En transmilenio\",((0.68516*S1091)/140)))))","v":0},"Nunca",0,"No dejo restos de alimentos",0,{"$f":"V1091+T1091+Q1091+O1091+I1091+X1091","v":0},{"$f":"Y1091/1000","v":0},{"$f":"Y1091*12","v":0},0]
[null,null,null,null,null,"Calentador a Gas",null,null,0,"Tecnología solar ",null,null,null,null,0,null,0," En transmilenio",null,0,"Nunca",0,"No dejo restos de alimentos",0,0,0,0,0]
[null,null,null,null,null,"Calentador a Gas",null,null,0,"Tecnología solar ",null,null,null,null,0,null,0," En transmilenio",null,0,"Nunca",0,"No dejo restos de alimentos",{"$f":"IF(W1093=\"No dejo restos de alimentos\",(0),IF(W1093=\"Un cuarto del plato\",(0.25*0.5*0.8312*30),IF(W1093=\"La mitad del plato\",(0.5*0.5*0.8312*30),IF(W1093=\"Tres cuartos del plato\",(0.75*0.5*0.8312*30)))))","v":0},0,0,0,0]
[null,null,null,null,null,"Calentador a Gas",null,null,0,"Tecnología solar ",null,null,null,null,0,null,0," En transmilenio",null,0,"Nunca",0,"No dejo restos de alimentos",0,0,0,0,0]
[null,null,null,null,null,"Calentador a Gas",null,null,0,"Tecnología solar ",null,null,null,null,0,null,0," En transmilenio",null,0,"Nunca",0,"No dejo restos de alimentos",0,0,0,0,0]
[null,null,null,null,null,"Calentador a Gas",null,null,0,"Tecnología solar ",null,null,null,null,0,null,0," En transmilenio",null,0,"Nunca",0,"No dejo restos de alimentos",0,0,0,0,0]
[null,null,null,null,null,"Calentador a Gas",null,null,0,"Tecnología solar ",null,null,null,null,0,null,0," En transmilenio",null,0,"Nunca",0,"No dejo restos de alimentos",0,0,0,0,0]
[null,null,null,null,null,"Calentador a Gas",null,null,0,"Tecnología solar ",null,null,null,null,0,null,0," En transmilenio",null,0,"Nunca",0,"No dejo restos de alimentos",0,0,0,0,0]
[null,null,null,null,null,"Calentador a Gas",null,null,0,"Tecnología solar ",null,null,null,null,0,null,0," En transmilenio",null,0,"Nunca",0,"No dejo restos de alimentos",0,0,0,0,0]
[null,null,null,null,null,"Calentador a Gas",null,null,0,"Tecnología solar ",null,null,null,null,0,null,0," En transmilenio",null,0,"Nunca",0,"No dejo restos de alimentos",0,0,0,0,0]
[null,null,null,null,null,"Calentador a Gas",null,null,0,"Tecnología solar ",null,null,null,null,0,null,0," En transmilenio",null,0,"Nunca",0,"No dejo restos de alimentos",0,0,0,0,0]
[null,null,null,null,null,"Calentador a Gas",null,null,0,"Tecnología solar ",null,null,null,null,0,null,0," En transmilenio",null,0,"Nunca",0,"No dejo restos de alimentos",0,0,0,0,0]
[null,null,null,null,null,"Calentador a Gas",null,null,0,"Tecnología solar ",null,null,null,null,0,null,0," En transmilenio",null,0,"Nunca",0,"No dejo restos de alimentos",0,0,0,0,0]
[null,null,null,null,null,"Calentador a Gas",null,null,0,"Tecnología solar ",null,null,null,null,0,null,0," En transmilenio",null,0,"Nunca",0,"No dejo restos de alimentos",0,0,0,0,0]
[null,null,null,null,null,"Calentador a Gas",null,null,0,"Tecnología solar ",null,null,null,null,0,null,0," En transmilenio",null,0,"Nunca",0,"No dejo restos de alimentos",0,0,0,0,0]
[null,null,null,null,null,"Calentador a Gas",null,null,0,"Tecnología solar ",null,null,null,null,0,null,0," En transmilenio",null,0,"Nunca",0,"No dejo restos de alimentos",0,0,0,0,0]
[null,null,null,null,null,"Calentador a Gas",null,null,0,"Tecnología solar ",null,null,null,null,0,null,0," En transmilenio",null,0,"Nunca",0,"No dejo restos de alimentos",0,0,0,0,0]
[null,null,null,null,null,"Calentador a Gas",null,null,0,"Tecnología solar ",null,null,null,null,0,null,0," En transmilenio",null,0,"Nunca",0,"No dejo restos de alimentos",0,0,0,0,0]
[null,null,null,null,null,"Calentador a Gas",null,null,0,"Tecnología solar ",null,null,null,null,0,null,0," En transmilenio",null,0,"Nunca",0,"No dejo restos de alimentos",0,0,0,0,0]
[null,null,null,null,null,"Calentador a Gas",null,null,0,"Tecnología solar ",null,null,null,null,0,null,0," En transmilenio",null,0,"Nunca",0,"No dejo restos de alimentos",0,0,0,0,0]
[null,null,null,null,null,"Calentador a Gas",null,null,0,"Tecnología solar ",null,null,null,null,0,null,0," En transmilenio",null,0,"Nunca",0,"No dejo restos de alimentos",0,0,0,0,0]
[null,null,null,null,null,"Calentador a Gas",null,null,0,"Tecnología solar ",null,null,null,null,0,null,0," En transmilenio",null,0,"Nunca",0,"No dejo restos de alimentos",0,0,0,0,0]
[null,null,null,null,null,"Calentador a Gas",null,null,0,"Tecnología solar ",null,null,null,null,0,null,0," En transmilenio",null,0,"Nunca",0,"No dejo restos de alimentos",0,0,0,0,0]
[null,null,null,null,null,"Calentador a Gas",null,null,0,"Tecnología solar ",null,null,null,null,0,null,0," En transmilenio",null,0,"Nunca",0,"No dejo restos de alimentos",0,0,0,0,0]
[null,null,null,null,null,"Calentador a Gas",null,null,0,"Tecnología solar ",null,null,null,null,0,null,0," En transmilenio",null,0,"Nunca",0,"No dejo restos de alimentos",0,0,0,0,0]
[null,null,null,null,null,"Calentador a Gas",null,null,0,"Tecnología solar ",null,null,null,null,0,null,0," En transmilenio",null,0,"Nunca",0,"No dejo restos de alimentos",0,0,0,0,0]
[null,null,null,null,null,"Calentador a Gas",null,null,0,"Tecnología solar ",null,null,null,null,0,null,0," En transmilenio",null,0,"Nunca",0,"No dejo restos de alimentos",0,0,0,0,0]
[null,null,null,null,null,"Calentador a Gas",null,null,0,"Tecnología solar ",null,null,null,null,0,null,0," En transmilenio",null,0,"Nunca",0,"No dejo restos de alimentos",0,0,0,0,0]
[null,null,null,null,null,"Calentador a Gas",null,null,0,"Tecnología solar ",null,null,null,null,0,null,0," En transmilenio",null,0,"Nunca",0,"No dejo restos de alimentos",0,0,0,0,0]
[null,null,null,null,null,"Calentador a Gas",null,null,0,"Tecnología solar ",null,null,null,null,0,null,0," En transmilenio",null,0,"Nunca",0,"No dejo restos de alimentos",0,0,0,0,0]
[null,null,null,null,null,"Calentador a Gas",null,null,0,"Tecnología solar ",null,null,null,null,0,null,0," En transmilenio",null,0,"Nunca",0,"No dejo restos de alimentos",0,0,0,0,0]
[null,null,null,null,null,"Calentador a Gas",null,null,0,"Tecnología solar ",null,null,null,null,0,null,0," En transmilenio",null,0,"Nunca",0,"No dejo restos de alimentos",0,0,0,0,0]
[null,null,null,null,null,"Calentador a Gas",null,null,0,"Tecnología solar ",null,null,null,null,0,null,0," En transmilenio",null,0,"Nunca",0,"No dejo restos de alimentos",0,0,0,0,0]
[null,null,null,null,null,"Calentador a Gas",null,null,0,"Tecnología solar ",null,null,null,null,0,null,0," En transmilenio",null,0,"Nunca",0,"No dejo restos de alimentos",0,0,0,0,0]
[null,null,null,null,null,"Calentador a Gas",null,null,0,"Tecnología solar ",null,null,null,null,0,null,0," En transmilenio",null,0,"Nunca",0,"No dejo restos de alimentos",0,0,0,0,0]
[null,null,null,null,null,"Calentador a Gas",null,null,0,"Tecnología solar ",null,null,null,null,0,null,0," En transmilenio",null,0,"Nunca",0,"No dejo restos de alimentos",0,0,0,0,0]
[null,null,null,null,null,"Calentador a Gas",null,null,0,"Tecnología solar ",null,null,null,null,0,null,0," En transmilenio",null,0,"Nunca",0,"No dejo restos de alimentos",0,0,0,0,0]
[null,null,null,null,null,"Calentador a Gas",null,null,0,"Tecnología solar ",null,null,null,null,0,null,0," En transmilenio",null,0,"Nunca",0,"No dejo restos de alimentos",0,0,0,0,0]
[null,null,null,null,null,"Calentador a Gas",null,null,0,"Tecnología solar ",null,null,null,null,0,null,0," En transmilenio",null,0,"Nunca",0,"No dejo restos de alimentos",0,0,0,0,0]
[null,null,null,null,null,"Calentador a Gas",null,null,0,"Tecnología solar ",null,null,null,null,0,null,0," En transmilenio",null,0,"Nunca",0,"No dejo restos de alimentos",0,0,0,0,0]
[null,null,null,null,null,"Calentador a Gas",null,null,0,"Tecnología solar ",null,null,null,null,0,null,0," En transmilenio",null,0,"Nunca",0,"No dejo restos de alimentos",0,0,0,0,0]
[null,null,null,null,null,"Calentador a Gas",null,null,0,"Tecnología solar ",null,null,null,null,0,null,0," En transmilenio",null,0,"Nunca",0,"No dejo restos de alimentos",0,0,0,0,0]
[null,null,null,null,null,"Calentador a Gas",null,null,0,"Tecnología solar ",null,null,null,null,0,null,0," En transmilenio",null,0,"Nunca",0,"No dejo restos de alimentos",0,0,0,0,0]
[null,null,null,null,null,"Calentador a Gas",null,null,0,"Tecnología solar ",null,null,null,null,0,null,0," En transmilenio",null,0,"Nunca",0,"No dejo restos de alimentos",0,0,0,0,0]
[null,null,null,null,null,"Calentador a Gas",null,null,0,"Tecnología solar ",null,null,null,null,0,null,0," En transmilenio",null,0,"Nunca",0,"No dejo restos de alimentos",0,0,0,0,0]
[null,null,null,null,null,"Calentador a Gas",null,null,0,"Tecnología solar ",null,null,null,null,0,null,0," En transmilenio",null,0,"Nunca",0,"No dejo restos de alimentos",0,0,0,0,0]
[null,null,null,null,null,"Calentador a Gas",null,null,0,"Tecnología solar ",null,null,null,null,0,null,0," En transmilenio",null,0,"Nunca",0,"No dejo restos de alimentos",0,0,0,0,0]
[null,null,null,null,null,"Calentador a Gas",null,null,0,"Tecnología solar ",null,null,null,null,0,null,0," En transmilenio",null,0,"Nunca",0,"No dejo restos de alimentos",0,0,0,0,0]
[null,null,null,null,null,"Calentador a Gas",null,null,0,"Tecnología solar ",null,null,null,null,0,null,0," En transmilenio",null,0,"Nunca",0,"No dejo restos de alimentos",0,0,0,0,0]
[null,null,null,null,null,"Calentador a Gas",null,null,0,"Tecnología solar ",null,null,null,null,0,null,0," En transmilenio",null,0,"Nunca",0,"No dejo restos de alimentos",0,0,0,0,0]
[null,null,null,null,null,"Calentador a Gas",null,null,0,"Tecnología solar ",null,null,null,null,0,null,0," En transmilenio",null,0,"Nunca",0,"No dejo restos de alimentos",0,0,0,0,0]
[null,null,null,null,null,"Calentador a Gas",null,null,0,"Tecnología solar ",null,null,null,null,0,null,0," En transmilenio",null,0,"Nunca",0,"No dejo restos de alimentos",0,0,0,0,0]
[null,null,null,null,null,"Calentador a Gas",null,null,0,"Tecnología solar ",null,null,null,null,0,null,0," En transmilenio",null,0,"Nunca",0,"No dejo restos de alimentos",0,0,0,0,0]
[null,null,null,null,null,"Calentador a Gas",null,null,0,"Tecnología solar ",null,null,null,null,0,null,0," En transmilenio",null,0,"Nunca",0,"No dejo restos de alimentos",0,0,0,0,0]
[null,null,null,null,null,"Calentador a Gas",null,null,0,"Tecnología solar ",null,null,null,null,0,null,0," En transmilenio",null,0,"Nunca",0,"No dejo restos de alimentos",0,0,0,0,0]
[null,null,null,null,null,"Calentador a Gas",null,null,0,"Tecnología solar ",null,null,null,null,0,null,0," En transmilenio",null,0,"Nunca",0,"No dejo restos de alimentos",0,0,0,0,0]
[null,null,null,null,null,"Calentador a Gas",null,null,0,"Tecnología solar ",null,null,null,null,0,null,0," En transmilenio",null,0,"Nunca",0,"No dejo restos de alimentos",0,0,0,0,0]
[null,null,null,null,null,"Calentador a Gas",null,null,0,"Tecnología solar ",null,null,null,null,0,null,0," En transmilenio",null,0,"Nunca",0,"No dejo restos de alimentos",0,0,0,0,0]
[null,null,null,null,null,"Calentador a Gas",null,null,0,"Tecnología solar ",null,null,null,null,0,null,0," En transmilenio",null,0,"Nunca",0,"No dejo restos de alimentos",0,0,0,0,0]
[null,null,null,null,null,"Calentador a Gas",null,null,0,"Tecnología solar ",null,null,null,null,0,null,0," En transmilenio",null,0,"Nunca",0,"No dejo restos de alimentos",0,0,0,0,0]
[null,null,null,null,null,"Calentador a Gas",null,null,0,"Tecnología solar ",null,null,null,null,0,null,0," En transmilenio",null,0,"Nunca",0,"No dejo restos de alimentos",0,0,0,0,0]
[null,null,null,null,null,"Calentador a Gas",null,null,0,"Tecnología solar ",null,null,null,null,0,null,0," En transmilenio",null,0,"Nunca",0,"No dejo restos de alimentos",0,0,0,0,0]
[null,null,null,null,null,"Calentador a Gas",null,null,0,"Tecnología solar ",null,null,null,null,0,null,0," En transmilenio",null,0,"Nunca",0,"No dejo restos de alimentos",0,0,0,0,0]
[null,null,null,null,null,"Calentador a Gas",null,null,0,"Tecnología solar ",null,null,null,null,0,null,0," En transmilenio",null,0,"Nunca",{"$f":"IF(U1154=\"Nunca\",0,IF(U1154=\"3 veces por semana\",\"513\",IF(U1154=\"5 veces por semana\",855,IF(U1154=\"Todos los días\",1197))))","v":0},"No dejo restos de alimentos",0,0,0,0,0]
[null,null,null,null,null,"Calentador a Gas",null,null,{"$f":"IF(F1155=\"Calentador a Gas\",(H1155*1.6*1.98*30),IF(F1155=\"Calentador Eléctrico\",(H1155*1.3*0.199*30),IF(F1155=\"Ducha Eléctrica\",(H1155*4*0.199*30),IF(F1155=\"Ninguno\",\"0\"))))","v":0},"Tecnología solar ",null,null,null,null,{"$f":"IF(J1155=\"Ahorradores \",(K1155*0.02*5*0.199*30),IF(J1155=\"Incandescentes \",(M1155*0.1*5*0.199*30),IF(J1155=\"LED\",(L1155*0.007*5*0.199*30),IF(J1155=\"Tecnología solar \",(N1155*0)))))","v":0},null,{"$f":"P1155*9*0.8312","v":0}," En transmilenio",null,{"$f":"IF(R1155=\"En bicicleta\",(0*S1155),IF(R1155=\"En carro\",(0.218 *S1155),IF(R1155=\"En bus o SITP \",((0.78703*S1155)/40),IF(R1155=\" En transmilenio\",((0.68516*S1155)/140)))))","v":0},"Nunca",0,"No dejo restos de alimentos",0,{"$f":"V1155+T1155+Q1155+O1155+I1155+X1155","v":0},{"$f":"Y1155/1000","v":0},{"$f":"Y1155*12","v":0},0]
[null,null,null,null,null,"Calentador a Gas",null,null,0,"Tecnología solar ",null,null,null,null,0,null,0," En transmilenio",null,0,"Nunca",0,"No dejo restos de alimentos",0,0,0,0,0]
[null,null,null,null,null,"Calentador a Gas",null,null,0,"Tecnología solar ",null,null,null,null,0,null,0," En transmilenio",null,0,"Nunca",0,"No dejo restos de alimentos",{"$f":"IF(W1157=\"No dejo restos de alimentos\",(0),IF(W1157=\"Un cuarto del plato\",(0.25*0.5*0.8312*30),IF(W1157=\"La mitad del plato\",(0.5*0.5*0.8312*30),IF(W1157=\"Tres cuartos del plato\",(0.75*0.5*0.8312*30)))))","v":0},0,0,0,0]
[null,null,null,null,null,"Calentador a Gas",null,null,0,"Tecnología solar ",null,null,null,null,0,null,0," En transmilenio",null,0,"Nunca",0,"No dejo restos de alimentos",0,0,0,0,0]
[null,null,null,null,null,"Calentador a Gas",null,null,0,"Tecnología solar ",null,null,null,null,0,null,0," En transmilenio",null,0,"Nunca",0,"No dejo restos de alimentos",0,0,0,0,0]
[null,null,null,null,null,"Calentador a Gas",null,null,0,"Tecnología solar ",null,null,null,null,0,null,0," En transmilenio",null,0,"Nunca",0,"No dejo restos de alimentos",0,0,0,0,0]
[null,null,null,null,null,"Calentador a Gas",null,null,0,"Tecnología solar ",null,null,null,null,0,null,0," En transmilenio",null,0,"Nunca",0,"No dejo restos de alimentos",0,0,0,0,0]
[null,null,null,null,null,"Calentador a Gas",null,null,0,"Tecnología solar ",null,null,null,null,0,null,0," En transmilenio",null,0,"Nunca",0,"No dejo restos de alimentos",0,0,0,0,0]
[null,null,null,null,null,"Calentador a Gas",null,null,0,"Tecnología solar ",null,null,null,null,0,null,0," En transmilenio",null,0,"Nunca",0,"No dejo restos de alimentos",0,0,0,0,0]
[null,null,null,null,null,"Calentador a Gas",null,null,0,"Tecnología solar ",null,null,null,null,0,null,0," En transmilenio",null,0,"Nunca",0,"No dejo restos de alimentos",0,0,0,0,0]
[null,null,null,null,null,"Calentador a Gas",null,null,0,"Tecnología solar ",null,null,null,null,0,null,0," En transmilenio",null,0,"Nunca",0,"No dejo restos de alimentos",0,0,0,0,0]
[null,null,null,null,null,"Calentador a Gas",null,null,0,"Tecnología solar ",null,null,null,null,0,null,0," En transmilenio",null,0,"Nunca",0,"No dejo restos de alimentos",0,0,0,0,0]
[null,null,null,null,null,"Calentador a Gas",null,null,0,"Tecnología solar ",null,null,null,null,0,null,0," En transmilenio",null,0,"Nunca",0,"No dejo restos de alimentos",0,0,0,0,0]
[null,null,null,null,null,"Calentador a Gas",null,null,0,"Tecnología solar ",null,null,null,null,0,null,0," En transmilenio",null,0,"Nunca",0,"No dejo restos de alimentos",0,0,0,0,0]
[null,null,null,null,null,"Calentador a Gas",null,null,0,"Tecnología solar ",null,null,null,null,0,null,0," En transmilenio",null,0,"Nunca",0,"No dejo restos de alimentos",0,0,0,0,0]
[null,null,null,null,null,"Calentador a Gas",null,null,0,"Tecnología solar ",null,null,null,null,0,null,0," En transmilenio",null,0,"Nunca",0,"No dejo restos de alimentos",0,0,0,0,0]
[null,null,null,null,null,"Calentador a Gas",null,null,0,"Tecnología solar ",null,null,null,null,0,null,0," En transmilenio",null,0,"Nunca",0,"No dejo restos de alimentos",0,0,0,0,0]
[null,null,null,null,null,"Calentador a Gas",null,null,0,"Tecnología solar ",null,null,null,null,0,null,0," En transmilenio",null,0,"Nunca",0,"No dejo restos de alimentos",0,0,0,0,0]
[null,null,null,null,null,"Calentador a Gas",null,null,0,"Tecnología solar ",null,null,null,null,0,null,0," En transmilenio",null,0,"Nunca",0,"No dejo restos de alimentos",0,0,0,0,0]
[null,null,null,null,null,"Calentador a Gas",null,null,0,"Tecnología solar ",null,null,null,null,0,null,0," En transmilenio",null,0,"Nunca",0,"No dejo restos de alimentos",0,0,0,0,0]
[null,null,null,null,null,"Calentador a Gas",null,null,0,"Tecnología solar ",null,null,null,null,0,null,0," En transmilenio",null,0,"Nunca",0,"No dejo restos de alimentos",0,0,0,0,0]
[null,null,null,null,null,"Calentador a Gas",null,null,0,"Tecnología solar ",null,null,null,null,0,null,0," En transmilenio",null,0,"Nunca",0,"No dejo restos de alimentos",0,0,0,0,0]
[null,null,null,null,null,"Calentador a Gas",null,null,0,"Tecnología solar ",null,null,null,null,0,null,0," En transmilenio",null,0,"Nunca",0,"No dejo restos de alimentos",0,0,0,0,0]
[null,null,null,null,null,"Calentador a Gas",null,null,0,"Tecnología solar ",null,null,null,null,0,null,0," En transmilenio",null,0,"Nunca",0,"No dejo restos de alimentos",0,0,0,0,0]
[null,null,null,null,null,"Calentador a Gas",null,null,0,"Tecnología solar ",null,null,null,null,0,null,0," En transmilenio",null,0,"Nunca",0,"No dejo restos de alimentos",0,0,0,0,0]
[null,null,null,null,null,"Calentador a Gas",null,null,0,"Tecnología solar ",null,null,null,null,0,null,0," En transmilenio",null,0,"Nunca",0,"No dejo restos de alimentos",0,0,0,0,0]
[null,null,null,null,null,"Calentador a Gas",null,null,0,"Tecnología solar ",null,null,null,null,0,null,0," En transmilenio",null,0,"Nunca",0,"No dejo restos de alimentos",0,0,0,0,0]
[null,null,null,null,null,"Calentador a Gas",null,null,0,"Tecnología solar ",null,null,null,null,0,null,0," En transmilenio",null,0,"Nunca",0,"No dejo restos de alimentos",0,0,0,0,0]
[null,null,null,null,null,"Calentador a Gas",null,null,0,"Tecnología solar ",null,null,null,null,0,null,0," En transmilenio",null,0,"Nunca",0,"No dejo restos de alimentos",0,0,0,0,0]
[null,null,null,null,null,"Calentador a Gas",null,null,0,"Tecnología solar ",null,null,null,null,0,null,0," En transmilenio",null,0,"Nunca",0,"No dejo restos de alimentos",0,0,0,0,0]
[null,null,null,null,null,"Calentador a Gas",null,null,0,"Tecnología solar ",null,null,null,null,0,null,0," En transmilenio",null,0,"Nunca",0,"No dejo restos de alimentos",0,0,0,0,0]
[null,null,null,null,null,"Calentador a Gas",null,null,0,"Tecnología solar ",null,null,null,null,0,null,0," En transmilenio",null,0,"Nunca",0,"No dejo restos de alimentos",0,0,0,0,0]
[null,null,null,null,null,"Calentador a Gas",null,null,0,"Tecnología solar ",null,null,null,null,0,null,0," En transmilenio",null,0,"Nunca",0,"No dejo restos de alimentos",0,0,0,0,0]
[null,null,null,null,null,"Calentador a Gas",null,null,0,"Tecnología solar ",null,null,null,null,0,null,0," En transmilenio",null,0,"Nunca",0,"No dejo restos de alimentos",0,0,0,0,0]
[null,null,null,null,null,"Calentador a Gas",null,null,0,"Tecnología solar ",null,null,null,null,0,null,0," En transmilenio",null,0,"Nunca",0,"No dejo restos de alimentos",0,0,0,0,0]
[null,null,null,null,null,"Calentador a Gas",null,null,0,"Tecnología solar ",null,null,null,null,0,null,0," En transmilenio",null,0,"Nunca",0,"No dejo restos de alimentos",0,0,0,0,0]
[null,null,null,null,null,"Calentador a Gas",null,null,0,"Tecnología solar ",null,null,null,null,0,null,0," En transmilenio",null,0,"Nunca",0,"No dejo restos de alimentos",0,0,0,0,0]
[null,null,null,null,null,"Calentador a Gas",null,null,0,"Tecnología solar ",null,null,null,null,0,null,0," En transmilenio",null,0,"Nunca",0,"No dejo restos de alimentos",0,0,0,0,0]
[null,null,null,null,null,"Calentador a Gas",null,null,0,"Tecnología solar ",null,null,null,null,0,null,0," En transmilenio",null,0,"Nunca",0,"No dejo restos de alimentos",0,0,0,0,0]
[null,null,null,null,null,"Calentador a Gas",null,null,0,"Tecnología solar ",null,null,null,null,0,null,0," En transmilenio",null,0,"Nunca",0,"No dejo restos de alimentos",0,0,0,0,0]
[null,null,null,null,null,"Calentador a Gas",null,null,0,"Tecnología solar ",null,null,null,null,0,null,0," En transmilenio",null,0,"Nunca",0,"No dejo restos de alimentos",0,0,0,0,0]
[null,null,null,null,null,"Calentador a Gas",null,null,0,"Tecnología solar ",null,null,null,null,0,null,0," En transmilenio",null,0,"Nunca",0,"No dejo restos de alimentos",0,0,0,0,0]
[null,null,null,null,null,"Calentador a Gas",null,null,0,"Tecnología solar ",null,null,null,null,0,null,0," En transmilenio",null,0,"Nunca",0,"No dejo restos de alimentos",0,0,0,0,0]
[null,null,null,null,null,"Calentador a Gas",null,null,0,"Tecnología solar ",null,null,null,null,0,null,0," En transmilenio",null,0,"Nunca",0,"No dejo restos de alimentos",0,0,0,0,0]
[null,null,null,null,null,"Calentador a Gas",null,null,0,"Tecnología solar ",null,null,null,null,0,null,0," En transmilenio",null,0,"Nunca",0,"No dejo restos de alimentos",0,0,0,0,0]
[null,null,null,null,null,"Calentador a Gas",null,null,0,"Tecnología solar ",null,null,null,null,0,null,0," En transmilenio",null,0,"Nunca",0,"No dejo restos de alimentos",0,0,0,0,0]
[null,null,null,null,null,"Calentador a Gas",null,null,0,"Tecnología solar ",null,null,null,null,0,null,0," En transmilenio",null,0,"Nunca",0,"No dejo restos de alimentos",0,0,0,0,0]
[null,null,null,null,null,"Calentador a Gas",null,null,0,"Tecnología solar ",null,null,null,null,0,null,0," En transmilenio",null,0,"Nunca",0,"No dejo restos de alimentos",0,0,0,0,0]
[null,null,null,null,null,"Calentador a Gas",null,null,0,"Tecnología solar ",null,null,null,null,0,null,0," En transmilenio",null,0,"Nunca",0,"No dejo restos de alimentos",0,0,0,0,0]
[null,null,null,null,null,"Calentador a Gas",null,null,0,"Tecnología solar ",null,null,null,null,0,null,0," En transmilenio",null,0,"Nunca",0,"No dejo restos de alimentos",0,0,0,0,0]
[null,null,null,null,null,"Calentador a Gas",null,null,0,"Tecnología solar ",null,null,null,null,0,null,0," En transmilenio",null,0,"Nunca",0,"No dejo restos de alimentos",0,0,0,0,0]
[null,null,null,null,null,"Calentador a Gas",null,null,0,"Tecnología solar ",null,null,null,null,0,null,0," En transmilenio",null,0,"Nunca",0,"No dejo restos de alimentos",0,0,0,0,0]
[null,null,null,null,null,"Calentador a Gas",null,null,0,"Tecnología solar ",null,null,null,null,0,null,0," En transmilenio",null,0,"Nunca",0,"No dejo restos de alimentos",0,0,0,0,0]
[null,null,null,null,null,"Calentador a Gas",null,null,0,"Tecnología solar ",null,null,null,null,0,null,0," En transmilenio",null,0,"Nunca",0,"No dejo restos de alimentos",0,0,0,0,0]
[null,null,null,null,null,"Calentador a Gas",null,null,0,"Tecnología solar ",null,null,null,null,0,null,0," En transmilenio",null,0,"Nunca",0,"No dejo restos de alimentos",0,0,0,0,0]
[null,null,null,null,null,"Calentador a Gas",null,null,0,"Tecnología solar ",null,null,null,null,0,null,0," En transmilenio",null,0,"Nunca",0,"No dejo restos de alimentos",0,0,0,0,0]
[null,null,null,null,null,"Calentador a Gas",null,null,0,"Tecnología solar ",null,null,null,null,0,null,0," En transmilenio",null,0,"Nunca",0,"No dejo restos de alimentos",0,0,0,0,0]
[null,null,null,null,null,"Calentador a Gas",null,null,0,"Tecnología solar ",null,null,null,null,0,null,0," En transmilenio",null,0,"Nunca",0,"No dejo restos de alimentos",0,0,0,0,0]
[null,null,null,null,null,"Calentador a Gas",null,null,0,"Tecnología solar ",null,null,null,null,0,null,0," En transmilenio",null,0,"Nunca",0,"No dejo restos de alimentos",0,0,0,0,0]
[null,null,null,null,null,"Calentador a Gas",null,null,0,"Tecnología solar ",null,null,null,null,0,null,0," En transmilenio",null,0,"Nunca",0,"No dejo restos de alimentos",0,0,0,0,0]
[null,null,null,null,null,"Calentador a Gas",null,null,0,"Tecnología solar ",null,null,null,null,0,null,0," En transmilenio",null,0,"Nunca",0,"No dejo restos de alimentos",0,0,0,0,0]
[null,null,null,null,null,"Calentador a Gas",null,null,0,"Tecnología solar ",null,null,null,null,0,null,0," En transmilenio",null,0,"Nunca",0,"No dejo restos de alimentos",0,0,0,0,0]
[null,null,null,null,null,"Calentador a Gas",null,null,0,"Tecnología solar ",null,null,null,null,0,null,0," En transmilenio",null,0,"Nunca",0,"No dejo restos de alimentos",0,0,0,0,0]
[null,null,null,null,null,"Calentador a Gas",null,null,0,"Tecnología solar ",null,null,null,null,0,null,0," En transmilenio",null,0,"Nunca",{"$f":"IF(U1218=\"Nunca\",0,IF(U1218=\"3 veces por semana\",\"513\",IF(U1218=\"5 veces por semana\",855,IF(U1218=\"Todos los días\",1197))))","v":0},"No dejo restos de alimentos",0,0,0,0,0]
[null,null,null,null,null,"Calentador a Gas",null,null,{"$f":"IF(F1219=\"Calentador a Gas\",(H1219*1.6*1.98*30),IF(F1219=\"Calentador Eléctrico\",(H1219*1.3*0.199*30),IF(F1219=\"Ducha Eléctrica\",(H1219*4*0.199*30),IF(F1219=\"Ninguno\",\"0\"))))","v":0},"Tecnología solar ",null,null,null,null,{"$f":"IF(J1219=\"Ahorradores \",(K1219*0.02*5*0.199*30),IF(J1219=\"Incandescentes \",(M1219*0.1*5*0.199*30),IF(J1219=\"LED\",(L1219*0.007*5*0.199*30),IF(J1219=\"Tecnología solar \",(N1219*0)))))","v":0},null,{"$f":"P1219*9*0.8312","v":0}," En transmilenio",null,{"$f":"IF(R1219=\"En bicicleta\",(0*S1219),IF(R1219=\"En carro\",(0.218 *S1219),IF(R1219=\"En bus o SITP \",((0.78703*S1219)/40),IF(R1219=\" En transmilenio\",((0.68516*S1219)/140)))))","v":0},"Nunca",0,"No dejo restos de alimentos",0,{"$f":"V1219+T1219+Q1219+O1219+I1219+X1219","v":0},{"$f":"Y1219/1000","v":0},{"$f":"Y1219*12","v":0},0]
[null,null,null,null,null,"Calentador a Gas",null,null,0,"Tecnología solar ",null,null,null,null,0,null,0," En transmilenio",null,0,"Nunca",0,"No dejo restos de alimentos",0,0,0,0,0]
[null,null,null,null,null,"Calentador a Gas",null,null,0,"Tecnología solar ",null,null,null,null,0,null,0," En transmilenio",null,0,"Nunca",0,"No dejo restos de alimentos",{"$f":"IF(W1221=\"No dejo restos de alimentos\",(0),IF(W1221=\"Un cuarto del plato\",(0.25*0.5*0.8312*30),IF(W1221=\"La mitad del plato\",(0.5*0.5*0.8312*30),IF(W1221=\"Tres cuartos del plato\",(0.75*0.5*0.8312*30)))))","v":0},0,0,0,0]
[null,null,null,null,null,"Calentador a Gas",null,null,0,"Tecnología solar ",null,null,null,null,0,null,0," En transmilenio",null,0,"Nunca",0,"No dejo restos de alimentos",0,0,0,0,0]
[null,null,null,null,null,"Calentador a Gas",null,null,0,"Tecnología solar ",null,null,null,null,0,null,0," En transmilenio",null,0,"Nunca",0,"No dejo restos de alimentos",0,0,0,0,0]
[null,null,null,null,null,"Calentador a Gas",null,null,0,"Tecnología solar ",null,null,null,null,0,null,0," En transmilenio",null,0,"Nunca",0,"No dejo restos de alimentos",0,0,0,0,0]
[null,null,null,null,null,"Calentador a Gas",null,null,0,"Tecnología solar ",null,null,null,null,0,null,0," En transmilenio",null,0,"Nunca",0,"No dejo restos de alimentos",0,0,0,0,0]
[null,null,null,null,null,"Calentador a Gas",null,null,0,"Tecnología solar ",null,null,null,null,0,null,0," En transmilenio",null,0,"Nunca",0,"No dejo restos de alimentos",0,0,0,0,0]
[null,null,null,null,null,"Calentador a Gas",null,null,0,"Tecnología solar ",null,null,null,null,0,null,0," En transmilenio",null,0,"Nunca",0,"No dejo restos de alimentos",0,0,0,0,0]
[null,null,null,null,null,"Calentador a Gas",null,null,0,"Tecnología solar ",null,null,null,null,0,null,0," En transmilenio",null,0,"Nunca",0,"No dejo restos de alimentos",0,0,0,0,0]
[null,null,null,null,null,"Calentador a Gas",null,null,0,"Tecnología solar ",null,null,null,null,0,null,0," En transmilenio",null,0,"Nunca",0,"No dejo restos de alimentos",0,0,0,0,0]
[null,null,null,null,null,"Calentador a Gas",null,null,0,"Tecnología solar ",null,null,null,null,0,null,0," En transmilenio",null,0,"Nunca",0,"No dejo restos de alimentos",0,0,0,0,0]
[null,null,null,null,null,"Calentador a Gas",null,null,0,"Tecnología solar ",null,null,null,null,0,null,0," En transmilenio",null,0,"Nunca",0,"No dejo restos de alimentos",0,0,0,0,0]
[null,null,null,null,null,"Calentador a Gas",null,null,0,"Tecnología solar ",null,null,null,null,0,null,0," En transmilenio",null,0,"Nunca",0,"No dejo restos de alimentos",0,0,0,0,0]
[null,null,null,null,null,"Calentador a Gas",null,null,0,"Tecnología solar ",null,null,null,null,0,null,0," En transmilenio",null,0,"Nunca",0,"No dejo restos de alimentos",0,0,0,0,0]
[null,null,null,null,null,"Calentador a Gas",null,null,0,"Tecnología solar ",null,null,null,null,0,null,0," En transmilenio",null,0,"Nunca",0,"No dejo restos de alimentos",0,0,0,0,0]
[null,null,null,null,null,"Calentador a Gas",null,null,0,"Tecnología solar ",null,null,null,null,0,null,0," En transmilenio",null,0,"Nunca",0,"No dejo restos de alimentos",0,0,0,0,0]
[null,null,null,null,null,"Calentador a Gas",null,null,0,"Tecnología solar ",null,null,null,null,0,null,0," En transmilenio",null,0,"Nunca",0,"No dejo restos de alimentos",0,0,0,0,0]
[null,null,null,null,null,"Calentador a Gas",null,null,0,"Tecnología solar ",null,null,null,null,0,null,0," En transmilenio",null,0,"Nunca",0,"No dejo restos de alimentos",0,0,0,0,0]
[null,null,null,null,null,"Calentador a Gas",null,null,0,"Tecnología solar ",null,null,null,null,0,null,0," En transmilenio",null,0,"Nunca",0,"No dejo restos de alimentos",0,0,0,0,0]
[null,null,null,null,null,"Calentador a Gas",null,null,0,"Tecnología solar ",null,null,null,null,0,null,0," En transmilenio",null,0,"Nunca",0,"No dejo restos de alimentos",0,0,0,0,0]
[null,null,null,null,null,"Calentador a Gas",null,null,0,"Tecnología solar ",null,null,null,null,0,null,0," En transmilenio",null,0,"Nunca",0,"No dejo restos de alimentos",0,0,0,0,0]
[null,null,null,null,null,"Calentador a Gas",null,null,0,"Tecnología solar ",null,null,null,null,0,null,0," En transmilenio",null,0,"Nunca",0,"No dejo restos de alimentos",0,0,0,0,0]
[null,null,null,null,null,"Calentador a Gas",null,null,0,"Tecnología solar ",null,null,null,null,0,null,0," En transmilenio",null,0,"Nunca",0,"No dejo restos de alimentos",0,0,0,0,0]
[null,null,null,null,null,"Calentador a Gas",null,null,0,"Tecnología solar ",null,null,null,null,0,null,0," En transmilenio",null,0,"Nunca",0,"No dejo restos de alimentos",0,0,0,0,0]
[null,null,null,null,null,"Calentador a Gas",null,null,0,"Tecnología solar ",null,null,null,null,0,null,0," En transmilenio",null,0,"Nunca",0,"No dejo restos de alimentos",0,0,0,0,0]
[null,null,null,null,null,"Calentador a Gas",null,null,0,"Tecnología solar ",null,null,null,null,0,null,0," En transmilenio",null,0,"Nunca",0,"No dejo restos de alimentos",0,0,0,0,0]
[null,null,null,null,null,"Calentador a Gas",null,null,0,"Tecnología solar ",null,null,null,null,0,null,0," En transmilenio",null,0,"Nunca",0,"No dejo restos de alimentos",0,0,0,0,0]
[null,null,null,null,null,"Calentador a Gas",null,null,0,"Tecnología solar ",null,null,null,null,0,null,0," En transmilenio",null,0,"Nunca",0,"No dejo restos de alimentos",0,0,0,0,0]
[null,null,null,null,null,"Calentador a Gas",null,null,0,"Tecnología solar ",null,null,null,null,0,null,0," En transmilenio",null,0,"Nunca",0,"No dejo restos de alimentos",0,0,0,0,0]
[null,null,null,null,null,"Calentador a Gas",null,null,0,"Tecnología solar ",null,null,null,null,0,null,0," En transmilenio",null,0,"Nunca",0,"No dejo restos de alimentos",0,0,0,0,0]
[null,null,null,null,null,"Calentador a Gas",null,null,0,"Tecnología solar ",null,null,null,null,0,null,0," En transmilenio",null,0,"Nunca",0,"No dejo restos de alimentos",0,0,0,0,0]
[null,null,null,null,null,"Calentador a Gas",null,null,0,"Tecnología solar ",null,null,null,null,0,null,0," En transmilenio",null,0,"Nunca",0,"No dejo restos de alimentos",0,0,0,0,0]
[null,null,null,null,null,"Calentador a Gas",null,null,0,"Tecnología solar ",null,null,null,null,0,null,0," En transmilenio",null,0,"Nunca",0,"No dejo restos de alimentos",0,0,0,0,0]
[null,null,null,null,null,"Calentador a Gas",null,null,0,"Tecnología solar ",null,null,null,null,0,null,0," En transmilenio",null,0,"Nunca",0,"No dejo restos de alimentos",0,0,0,0,0]
[null,null,null,null,null,"Calentador a Gas",null,null,0,"Tecnología solar ",null,null,null,null,0,null,0," En transmilenio",null,0,"Nunca",0,"No dejo restos de alimentos",0,0,0,0,0]
[null,null,null,null,null,"Calentador a Gas",null,null,0,"Tecnología solar ",null,null,null,null,0,null,0," En transmilenio",null,0,"Nunca",0,"No dejo restos de alimentos",0,0,0,0,0]
[null,null,null,null,null,"Calentador a Gas",null,null,0,"Tecnología solar ",null,null,null,null,0,null,0," En transmilenio",null,0,"Nunca",0,"No dejo restos de alimentos",0,0,0,0,0]
[null,null,null,null,null,"Calentador a Gas",null,null,0,"Tecnología solar ",null,null,null,null,0,null,0," En transmilenio",null,0,"Nunca",0,"No dejo restos de alimentos",0,0,0,0,0]
[null,null,null,null,null,"Calentador a Gas",null,null,0,"Tecnología solar ",null,null,null,null,0,null,0," En transmilenio",null,0,"Nunca",0,"No dejo restos de alimentos",0,0,0,0,0]
[null,null,null,null,null,"Calentador a Gas",null,null,0,"Tecnología solar ",null,null,null,null,0,null,0," En transmilenio",null,0,"Nunca",0,"No dejo restos de alimentos",0,0,0,0,0]
[null,null,null,null,null,"Calentador a Gas",null,null,0,"Tecnología solar ",null,null,null,null,0,null,0," En transmilenio",null,0,"Nunca",0,"No dejo restos de alimentos",0,0,0,0,0]
[null,null,null,null,null,"Calentador a Gas",null,null,0,"Tecnología solar ",null,null,null,null,0,null,0," En transmilenio",null,0,"Nunca",0,"No dejo restos de alimentos",0,0,0,0,0]
[null,null,null,null,null,"Calentador a Gas",null,null,0,"Tecnología solar ",null,null,null,null,0,null,0," En transmilenio",null,0,"Nunca",0,"No dejo restos de alimentos",0,0,0,0,0]
[null,null,null,null,null,"Calentador a Gas",null,null,0,"Tecnología solar ",null,null,null,null,0,null,0," En transmilenio",null,0,"Nunca",0,"No dejo restos de alimentos",0,0,0,0,0]
[null,null,null,null,null,"Calentador a Gas",null,null,0,"Tecnología solar ",null,null,null,null,0,null,0," En transmilenio",null,0,"Nunca",0,"No dejo restos de alimentos",0,0,0,0,0]
[null,null,null,null,null,"Calentador a Gas",null,null,0,"Tecnología solar ",null,null,null,null,0,null,0," En transmilenio",null,0,"Nunca",0,"No dejo restos de alimentos",0,0,0,0,0]
[null,null,null,null,null,"Calentador a Gas",null,null,0,"Tecnología solar ",null,null,null,null,0,null,0," En transmilenio",null,0,"Nunca",0,"No dejo restos de alimentos",0,0,0,0,0]
[null,null,null,null,null,"Calentador a Gas",null,null,0,"Tecnología solar ",null,null,null,null,0,null,0," En transmilenio",null,0,"Nunca",0,"No dejo restos de alimentos",0,0,0,0,0]
[null,null,null,null,null,"Calentador a Gas",null,null,0,"Tecnología solar ",null,null,null,null,0,null,0," En transmilenio",null,0,"Nunca",0,"No dejo restos de alimentos",0,0,0,0,0]
[null,null,null,null,null,"Calentador a Gas",null,null,0,"Tecnología solar ",null,null,null,null,0,null,0," En transmilenio",null,0,"Nunca",0,"No dejo restos de alimentos",0,0,0,0,0]
[null,null,null,null,null,"Calentador a Gas",null,null,0,"Tecnología solar ",null,null,null,null,0,null,0," En transmilenio",null,0,"Nunca",0,"No dejo restos de alimentos",0,0,0,0,0]
[null,null,null,null,null,"Calentador a Gas",null,null,0,"Tecnología solar ",null,null,null,null,0,null,0," En transmilenio",null,0,"Nunca",0,"No dejo restos de alimentos",0,0,0,0,0]
[null,null,null,null,null,"Calentador a Gas",null,null,0,"Tecnología solar ",null,null,null,null,0,null,0," En transmilenio",null,0,"Nunca",0,"No dejo restos de alimentos",0,0,0,0,0]
[null,null,null,null,null,"Calentador a Gas",null,null,0,"Tecnología solar ",null,null,null,null,0,null,0," En transmilenio",null,0,"Nunca",0,"No dejo restos de alimentos",0,0,0,0,0]
[null,null,null,null,null,"Calentador a Gas",null,null,0,"Tecnología solar ",null,null,null,null,0,null,0," En transmilenio",null,0,"Nunca",0,"No dejo restos de alimentos",0,0,0,0,0]
[null,null,null,null,null,"Calentador a Gas",null,null,0,"Tecnología solar ",null,null,null,null,0,null,0," En transmilenio",null,0,"Nunca",0,"No dejo restos de alimentos",0,0,0,0,0]
[null,null,null,null,null,"Calentador a Gas",null,null,0,"Tecnología solar ",null,null,null,null,0,null,0," En transmilenio",null,0,"Nunca",0,"No dejo restos de alimentos",0,0,0,0,0]
[null,null,null,null,null,"Calentador a Gas",null,null,0,"Tecnología solar ",null,null,null,null,0,null,0," En transmilenio",null,0,"Nunca",0,"No dejo restos de alimentos",0,0,0,0,0]
[null,null,null,null,null,"Calentador a Gas",null,null,0,"Tecnología solar ",null,null,null,null,0,null,0," En transmilenio",null,0,"Nunca",0,"No dejo restos de alimentos",0,0,0,0,0]
[null,null,null,null,null,"Calentador a Gas",null,null,0,"Tecnología solar ",null,null,null,null,0,null,0," En transmilenio",null,0,"Nunca",0,"No dejo restos de alimentos",0,0,0,0,0]
[null,null,null,null,null,"Calentador a Gas",null,null,0,"Tecnología solar ",null,null,null,null,0,null,0," En transmilenio",null,0,"Nunca",0,"No dejo restos de alimentos",0,0,0,0,0]
[null,null,null,null,null,"Calentador a Gas",null,null,0,"Tecnología solar ",null,null,null,null,0,null,0," En transmilenio",null,0,"Nunca",0,"No dejo restos de alimentos",0,0,0,0,0]
[null,null,null,null,null,"Calentador a Gas",null,null,0,"Tecnología solar ",null,null,null,null,0,null,0," En transmilenio",null,0,"Nunca",{"$f":"IF(U1282=\"Nunca\",0,IF(U1282=\"3 veces por semana\",\"513\",IF(U1282=\"5 veces por semana\",855,IF(U1282=\"Todos los días\",1197))))","v":0},"No dejo restos de alimentos",0,0,0,0,0]
[null,null,null,null,null,"Calentador a Gas",null,null,{"$f":"IF(F1283=\"Calentador a Gas\",(H1283*1.6*1.98*30),IF(F1283=\"Calentador Eléctrico\",(H1283*1.3*0.199*30),IF(F1283=\"Ducha Eléctrica\",(H1283*4*0.199*30),IF(F1283=\"Ninguno\",\"0\"))))","v":0},"Tecnología solar ",null,null,null,null,{"$f":"IF(J1283=\"Ahorradores \",(K1283*0.02*5*0.199*30),IF(J1283=\"Incandescentes \",(M1283*0.1*5*0.199*30),IF(J1283=\"LED\",(L1283*0.007*5*0.199*30),IF(J1283=\"Tecnología solar \",(N1283*0)))))","v":0},null,{"$f":"P1283*9*0.8312","v":0}," En transmilenio",null,{"$f":"IF(R1283=\"En bicicleta\",(0*S1283),IF(R1283=\"En carro\",(0.218 *S1283),IF(R1283=\"En bus o SITP \",((0.78703*S1283)/40),IF(R1283=\" En transmilenio\",((0.68516*S1283)/140)))))","v":0},"Nunca",0,"No dejo restos de alimentos",0,{"$f":"V1283+T1283+Q1283+O1283+I1283+X1283","v":0},{"$f":"Y1283/1000","v":0},{"$f":"Y1283*12","v":0},0]
[null,null,null,null,null,"Calentador a Gas",null,null,0,"Tecnología solar ",null,null,null,null,0,null,0," En transmilenio",null,0,"Nunca",0,"No dejo restos de alimentos",0,0,0,0,0]
[null,null,null,null,null,"Calentador a Gas",null,null,0,"Tecnología solar ",null,null,null,null,0,null,0," En transmilenio",null,0,"Nunca",0,"No dejo restos de alimentos",{"$f":"IF(W1285=\"No dejo restos de alimentos\",(0),IF(W1285=\"Un cuarto del plato\",(0.25*0.5*0.8312*30),IF(W1285=\"La mitad del plato\",(0.5*0.5*0.8312*30),IF(W1285=\"Tres cuartos del plato\",(0.75*0.5*0.8312*30)))))","v":0},0,0,0,0]
[null,null,null,null,null,"Calentador a Gas",null,null,0,"Tecnología solar ",null,null,null,null,0,null,0," En transmilenio",null,0,"Nunca",0,"No dejo restos de alimentos",0,0,0,0,0]
[null,null,null,null,null,"Calentador a Gas",null,null,0,"Tecnología solar ",null,null,null,null,0,null,0," En transmilenio",null,0,"Nunca",0,"No dejo restos de alimentos",0,0,0,0,0]
[null,null,null,null,null,"Calentador a Gas",null,null,0,"Tecnología solar ",null,null,null,null,0,null,0," En transmilenio",null,0,"Nunca",0,"No dejo restos de alimentos",0,0,0,0,0]
[null,null,null,null,null,"Calentador a Gas",null,null,0,"Tecnología solar ",null,null,null,null,0,null,0," En transmilenio",null,0,"Nunca",0,"No dejo restos de alimentos",0,0,0,0,0]
[null,null,null,null,null,"Calentador a Gas",null,null,0,"Tecnología solar ",null,null,null,null,0,null,0," En transmilenio",null,0,"Nunca",0,"No dejo restos de alimentos",0,0,0,0,0]
[null,null,null,null,null,"Calentador a Gas",null,null,0,"Tecnología solar ",null,null,null,null,0,null,0," En transmilenio",null,0,"Nunca",0,"No dejo restos de alimentos",0,0,0,0,0]
[null,null,null,null,null,"Calentador a Gas",null,null,0,"Tecnología solar ",null,null,null,null,0,null,0," En transmilenio",null,0,"Nunca",0,"No dejo restos de alimentos",0,0,0,0,0]
[null,null,null,null,null,"Calentador a Gas",null,null,0,"Tecnología solar ",null,null,null,null,0,null,0," En transmilenio",null,0,"Nunca",0,"No dejo restos de alimentos",0,0,0,0,0]
[null,null,null,null,null,"Calentador a Gas",null,null,0,"Tecnología solar ",null,null,null,null,0,null,0," En transmilenio",null,0,"Nunca",0,"No dejo restos de alimentos",0,0,0,0,0]
[null,null,null,null,null,"Calentador a Gas",null,null,0,"Tecnología solar ",null,null,null,null,0,null,0," En transmilenio",null,0,"Nunca",0,"No dejo restos de alimentos",0,0,0,0,0]
[null,null,null,null,null,"Calentador a Gas",null,null,0,"Tecnología solar ",null,null,null,null,0,null,0," En transmilenio",null,0,"Nunca",0,"No dejo restos de alimentos",0,0,0,0,0]
[null,null,null,null,null,"Calentador a Gas",null,null,0,"Tecnología solar ",null,null,null,null,0,null,0," En transmilenio",null,0,"Nunca",0,"No dejo restos de alimentos",0,0,0,0,0]
[null,null,null,null,null,"Calentador a Gas",null,null,0,"Tecnología solar ",null,null,null,null,0,null,0," En transmilenio",null,0,"Nunca",0,"No dejo restos de alimentos",0,0,0,0,0]
[null,null,null,null,null,"Calentador a Gas",null,null,0,"Tecnología solar ",null,null,null,null,0,null,0," En transmilenio",null,0,"Nunca",0,"No dejo restos de alimentos",0,0,0,0,0]
[null,null,null,null,null,"Calentador a Gas",null,null,0,"Tecnología solar ",null,null,null,null,0,null,0," En transmilenio",null,0,"Nunca",0,"No dejo restos de alimentos",0,0,0,0,0]
[null,null,null,null,null,"Calentador a Gas",null,null,0,"Tecnología solar ",null,null,null,null,0,null,0," En transmilenio",null,0,"Nunca",0,"No dejo restos de alimentos",0,0,0,0,0]
[null,null,null,null,null,"Calentador a Gas",null,null,0,"Tecnología solar ",null,null,null,null,0,null,0," En transmilenio",null,0,"Nunca",0,"No dejo restos de alimentos",0,0,0,0,0]
[null,null,null,null,null,"Calentador a Gas",null,null,0,"Tecnología solar ",null,null,null,null,0,null,0," En transmilenio",null,0,"Nunca",0,"No dejo restos de alimentos",0,0,0,0,0]
[null,null,null,null,null,"Calentador a Gas",null,null,0,"Tecnología solar ",null,null,null,null,0,null,0," En transmilenio",null,0,"Nunca",0,"No dejo restos de alimentos",0,0,0,0,0]
[null,null,null,null,null,"Calentador a Gas",null,null,0,"Tecnología solar ",null,null,null,null,0,null,0," En transmilenio",null,0,"Nunca",0,"No dejo restos de alimentos",0,0,0,0,0]
[null,null,null,null,null,"Calentador a Gas",null,null,0,"Tecnología solar ",null,null,null,null,0,null,0," En transmilenio",null,0,"Nunca",0,"No dejo restos de alimentos",0,0,0,0,0]
[null,null,null,null,null,"Calentador a Gas",null,null,0,"Tecnología solar ",null,null,null,null,0,null,0," En transmilenio",null,0,"Nunca",0,"No dejo restos de alimentos",0,0,0,0,0]
[null,null,null,null,null,"Calentador a Gas",null,null,0,"Tecnología solar ",null,null,null,null,0,null,0," En transmilenio",null,0,"Nunca",0,"No dejo restos de alimentos",0,0,0,0,0]
[null,null,null,null,null,"Calentador a Gas",null,null,0,"Tecnología solar ",null,null,null,null,0,null,0," En transmilenio",null,0,"Nunca",0,"No dejo restos de alimentos",0,0,0,0,0]
[null,null,null,null,null,"Calentador a Gas",null,null,0,"Tecnología solar ",null,null,null,null,0,null,0," En transmilenio",null,0,"Nunca",0,"No dejo restos de alimentos",0,0,0,0,0]
[null,null,null,null,null,"Calentador a Gas",null,null,0,"Tecnología solar ",null,null,null,null,0,null,0," En transmilenio",null,0,"Nunca",0,"No dejo restos de alimentos",0,0,0,0,0]
[null,null,null,null,null,"Calentador a Gas",null,null,0,"Tecnología solar ",null,null,null,null,0,null,0," En transmilenio",null,0,"Nunca",0,"No dejo restos de alimentos",0,0,0,0,0]
[null,null,null,null,null,"Calentador a Gas",null,null,0,"Tecnología solar ",null,null,null,null,0,null,0," En transmilenio",null,0,"Nunca",0,"No dejo restos de alimentos",0,0,0,0,0]
[null,null,null,null,null,"Calentador a Gas",null,null,0,"Tecnología solar ",null,null,null,null,0,null,0," En transmilenio",null,0,"Nunca",0,"No dejo restos de alimentos",0,0,0,0,0]
[null,null,null,null,null,"Calentador a Gas",null,null,0,"Tecnología solar ",null,null,null,null,0,null,0," En transmilenio",null,0,"Nunca",0,"No dejo restos de alimentos",0,0,0,0,0]
[null,null,null,null,null,"Calentador a Gas",null,null,0,"Tecnología solar ",null,null,null,null,0,null,0," En transmilenio",null,0,"Nunca",0,"No dejo restos de alimentos",0,0,0,0,0]
[null,null,null,null,null,"Calentador a Gas",null,null,0,"Tecnología solar ",null,null,null,null,0,null,0," En transmilenio",null,0,"Nunca",0,"No dejo restos de alimentos",0,0,0,0,0]
[null,null,null,null,null,"Calentador a Gas",null,null,0,"Tecnología solar ",null,null,null,null,0,null,0," En transmilenio",null,0,"Nunca",0,"No dejo restos de alimentos",0,0,0,0,0]
[null,null,null,null,null,"Calentador a Gas",null,null,0,"Tecnología solar ",null,null,null,null,0,null,0," En transmilenio",null,0,"Nunca",0,"No dejo restos de alimentos",0,0,0,0,0]
[null,null,null,null,null,"Calentador a Gas",null,null,0,"Tecnología solar ",null,null,null,null,0,null,0," En transmilenio",null,0,"Nunca",0,"No dejo restos de alimentos",0,0,0,0,0]
[null,null,null,null,null,"Calentador a Gas",null,null,0,"Tecnología solar ",null,null,null,null,0,null,0," En transmilenio",null,0,"Nunca",0,"No dejo restos de alimentos",0,0,0,0,0]
[null,null,null,null,null,"Calentador a Gas",null,null,0,"Tecnología solar ",null,null,null,null,0,null,0," En transmilenio",null,0,"Nunca",0,"No dejo restos de alimentos",0,0,0,0,0]
[null,null,null,null,null,"Calentador a Gas",null,null,0,"Tecnología solar ",null,null,null,null,0,null,0," En transmilenio",null,0,"Nunca",0,"No dejo restos de alimentos",0,0,0,0,0]
[null,null,null,null,null,"Calentador a Gas",null,null,0,"Tecnología solar ",null,null,null,null,0,null,0," En transmilenio",null,0,"Nunca",0,"No dejo restos de alimentos",0,0,0,0,0]
[null,null,null,null,null,"Calentador a Gas",null,null,0,"Tecnología solar ",null,null,null,null,0,null,0," En transmilenio",null,0,"Nunca",0,"No dejo restos de alimentos",0,0,0,0,0]
[null,null,null,null,null,"Calentador a Gas",null,null,0,"Tecnología solar ",null,null,null,null,0,null,0," En transmilenio",null,0,"Nunca",0,"No dejo restos de alimentos",0,0,0,0,0]
[null,null,null,null,null,"Calentador a Gas",null,null,0,"Tecnología solar ",null,null,null,null,0,null,0," En transmilenio",null,0,"Nunca",0,"No dejo restos de alimentos",0,0,0,0,0]
[null,null,null,null,null,"Calentador a Gas",null,null,0,"Tecnología solar ",null,null,null,null,0,null,0," En transmilenio",null,0,"Nunca",0,"No dejo restos de alimentos",0,0,0,0,0]
[null,null,null,null,null,"Calentador a Gas",null,null,0,"Tecnología solar ",null,null,null,null,0,null,0," En transmilenio",null,0,"Nunca",0,"No dejo restos de alimentos",0,0,0,0,0]
[null,null,null,null,null,"Calentador a Gas",null,null,0,"Tecnología solar ",null,null,null,null,0,null,0," En transmilenio",null,0,"Nunca",0,"No dejo restos de alimentos",0,0,0,0,0]
[null,null,null,null,null,"Calentador a Gas",null,null,0,"Tecnología solar ",null,null,null,null,0,null,0," En transmilenio",null,0,"Nunca",0,"No dejo restos de alimentos",0,0,0,0,0]
[null,null,null,null,null,"Calentador a Gas",null,null,0,"Tecnología solar ",null,null,null,null,0,null,0," En transmilenio",null,0,"Nunca",0,"No dejo restos de alimentos",0,0,0,0,0]
[null,null,null,null,null,"Calentador a Gas",null,null,0,"Tecnología solar ",null,null,null,null,0,null,0," En transmilenio",null,0,"Nunca",0,"No dejo restos de alimentos",0,0,0,0,0]
[null,null,null,null,null,"Calentador a Gas",null,null,0,"Tecnología solar ",null,null,null,null,0,null,0," En transmilenio",null,0,"Nunca",0,"No dejo restos de alimentos",0,0,0,0,0]
[null,null,null,null,null,"Calentador a Gas",null,null,0,"Tecnología solar ",null,null,null,null,0,null,0," En transmilenio",null,0,"Nunca",0,"No dejo restos de alimentos",0,0,0,0,0]
[null,null,null,null,null,"Calentador a Gas",null,null,0,"Tecnología solar ",null,null,null,null,0,null,0," En transmilenio",null,0,"Nunca",0,"No dejo restos de alimentos",0,0,0,0,0]
[null,null,null,null,null,"Calentador a Gas",null,null,0,"Tecnología solar ",null,null,null,null,0,null,0," En transmilenio",null,0,"Nunca",0,"No dejo restos de alimentos",0,0,0,0,0]
[null,null,null,null,null,"Calentador a Gas",null,null,0,"Tecnología solar ",null,null,null,null,0,null,0," En transmilenio",null,0,"Nunca",0,"No dejo restos de alimentos",0,0,0,0,0]
[null,null,null,null,null,"Calentador a Gas",null,null,0,"Tecnología solar ",null,null,null,null,0,null,0," En transmilenio",null,0,"Nunca",0,"No dejo restos de alimentos",0,0,0,0,0]
[null,null,null,null,null,"Calentador a Gas",null,null,0,"Tecnología solar ",null,null,null,null,0,null,0," En transmilenio",null,0,"Nunca",0,"No dejo restos de alimentos",0,0,0,0,0]
[null,null,null,null,null,"Calentador a Gas",null,null,0,"Tecnología solar ",null,null,null,null,0,null,0," En transmilenio",null,0,"Nunca",0,"No dejo restos de alimentos",0,0,0,0,0]
[null,null,null,null,null,"Calentador a Gas",null,null,0,"Tecnología solar ",null,null,null,null,0,null,0," En transmilenio",null,0,"Nunca",0,"No dejo restos de alimentos",0,0,0,0,0]
[null,null,null,null,null,"Calentador a Gas",null,null,0,"Tecnología solar ",null,null,null,null,0,null,0," En transmilenio",null,0,"Nunca",0,"No dejo restos de alimentos",0,0,0,0,0]
[null,null,null,null,null,"Calentador a Gas",null,null,0,"Tecnología solar ",null,null,null,null,0,null,0," En transmilenio",null,0,"Nunca",0,"No dejo restos de alimentos",0,0,0,0,0]
[null,null,null,null,null,"Calentador a Gas",null,null,0,"Tecnología solar ",null,null,null,null,0,null,0," En transmilenio",null,0,"Nunca",0,"No dejo restos de alimentos",0,0,0,0,0]
[null,null,null,null,null,"Calentador a Gas",null,null,0,"Tecnología solar ",null,null,null,null,0,null,0," En transmilenio",null,0,"Nunca",{"$f":"IF(U1346=\"Nunca\",0,IF(U1346=\"3 veces por semana\",\"513\",IF(U1346=\"5 veces por semana\",855,IF(U1346=\"Todos los días\",1197))))","v":0},"No dejo restos de alimentos",0,0,0,0,0]
[null,null,null,null,null,"Calentador a Gas",null,null,{"$f":"IF(F1347=\"Calentador a Gas\",(H1347*1.6*1.98*30),IF(F1347=\"Calentador Eléctrico\",(H1347*1.3*0.199*30),IF(F1347=\"Ducha Eléctrica\",(H1347*4*0.199*30),IF(F1347=\"Ninguno\",\"0\"))))","v":0},"Tecnología solar ",null,null,null,null,{"$f":"IF(J1347=\"Ahorradores \",(K1347*0.02*5*0.199*30),IF(J1347=\"Incandescentes \",(M1347*0.1*5*0.199*30),IF(J1347=\"LED\",(L1347*0.007*5*0.199*30),IF(J1347=\"Tecnología solar \",(N1347*0)))))","v":0},null,{"$f":"P1347*9*0.8312","v":0}," En transmilenio",null,{"$f":"IF(R1347=\"En bicicleta\",(0*S1347),IF(R1347=\"En carro\",(0.218 *S1347),IF(R1347=\"En bus o SITP \",((0.78703*S1347)/40),IF(R1347=\" En transmilenio\",((0.68516*S1347)/140)))))","v":0},"Nunca",0,"No dejo restos de alimentos",0,{"$f":"V1347+T1347+Q1347+O1347+I1347+X1347","v":0},{"$f":"Y1347/1000","v":0},{"$f":"Y1347*12","v":0},0]
[null,null,null,null,null,"Calentador a Gas",null,null,0,"Tecnología solar ",null,null,null,null,0,null,0," En transmilenio",null,0,"Nunca",0,"No dejo restos de alimentos",0,0,0,0,0]
[null,null,null,null,null,"Calentador a Gas",null,null,0,"Tecnología solar ",null,null,null,null,0,null,0," En transmilenio",null,0,"Nunca",0,"No dejo restos de alimentos",{"$f":"IF(W1349=\"No dejo restos de alimentos\",(0),IF(W1349=\"Un cuarto del plato\",(0.25*0.5*0.8312*30),IF(W1349=\"La mitad del plato\",(0.5*0.5*0.8312*30),IF(W1349=\"Tres cuartos del plato\",(0.75*0.5*0.8312*30)))))","v":0},0,0,0,0]
[null,null,null,null,null,"Calentador a Gas",null,null,0,"Tecnología solar ",null,null,null,null,0,null,0," En transmilenio",null,0,"Nunca",0,"No dejo restos de alimentos",0,0,0,0,0]
[null,null,null,null,null,"Calentador a Gas",null,null,0,"Tecnología solar ",null,null,null,null,0,null,0," En transmilenio",null,0,"Nunca",0,"No dejo restos de alimentos",0,0,0,0,0]
[null,null,null,null,null,"Calentador a Gas",null,null,0,"Tecnología solar ",null,null,null,null,0,null,0," En transmilenio",null,0,"Nunca",0,"No dejo restos de alimentos",0,0,0,0,0]
[null,null,null,null,null,"Calentador a Gas",null,null,0,"Tecnología solar ",null,null,null,null,0,null,0," En transmilenio",null,0,"Nunca",0,"No dejo restos de alimentos",0,0,0,0,0]
[null,null,null,null,null,"Calentador a Gas",null,null,0,"Tecnología solar ",null,null,null,null,0,null,0," En transmilenio",null,0,"Nunca",0,"No dejo restos de alimentos",0,0,0,0,0]
[null,null,null,null,null,"Calentador a Gas",null,null,0,"Tecnología solar ",null,null,null,null,0,null,0," En transmilenio",null,0,"Nunca",0,"No dejo restos de alimentos",0,0,0,0,0]
[null,null,null,null,null,"Calentador a Gas",null,null,0,"Tecnología solar ",null,null,null,null,0,null,0," En transmilenio",null,0,"Nunca",0,"No dejo restos de alimentos",0,0,0,0,0]
[null,null,null,null,null,"Calentador a Gas",null,null,0,"Tecnología solar ",null,null,null,null,0,null,0," En transmilenio",null,0,"Nunca",0,"No dejo restos de alimentos",0,0,0,0,0]
[null,null,null,null,null,"Calentador a Gas",null,null,0,"Tecnología solar ",null,null,null,null,0,null,0," En transmilenio",null,0,"Nunca",0,"No dejo restos de alimentos",0,0,0,0,0]
[null,null,null,null,null,"Calentador a Gas",null,null,0,"Tecnología solar ",null,null,null,null,0,null,0," En transmilenio",null,0,"Nunca",0,"No dejo restos de alimentos",0,0,0,0,0]
[null,null,null,null,null,"Calentador a Gas",null,null,0,"Tecnología solar ",null,null,null,null,0,null,0," En transmilenio",null,0,"Nunca",0,"No dejo restos de alimentos",0,0,0,0,0]
[null,null,null,null,null,"Calentador a Gas",null,null,0,"Tecnología solar ",null,null,null,null,0,null,0," En transmilenio",null,0,"Nunca",0,"No dejo restos de alimentos",0,0,0,0,0]
[null,null,null,null,null,"Calentador a Gas",null,null,0,"Tecnología solar ",null,null,null,null,0,null,0," En transmilenio",null,0,"Nunca",0,"No dejo restos de alimentos",0,0,0,0,0]
[null,null,null,null,null,"Calentador a Gas",null,null,0,"Tecnología solar ",null,null,null,null,0,null,0," En transmilenio",null,0,"Nunca",0,"No dejo restos de alimentos",0,0,0,0,0]
[null,null,null,null,null,"Calentador a Gas",null,null,0,"Tecnología solar ",null,null,null,null,0,null,0," En transmilenio",null,0,"Nunca",0,"No dejo restos de alimentos",0,0,0,0,0]
[null,null,null,null,null,"Calentador a Gas",null,null,0,"Tecnología solar ",null,null,null,null,0,null,0," En transmilenio",null,0,"Nunca",0,"No dejo restos de alimentos",0,0,0,0,0]
[null,null,null,null,null,"Calentador a Gas",null,null,0,"Tecnología solar ",null,null,null,null,0,null,0," En transmilenio",null,0,"Nunca",0,"No dejo restos de alimentos",0,0,0,0,0]
[null,null,null,null,null,"Calentador a Gas",null,null,0,"Tecnología solar ",null,null,null,null,0,null,0," En transmilenio",null,0,"Nunca",0,"No dejo restos de alimentos",0,0,0,0,0]
[null,null,null,null,null,"Calentador a Gas",null,null,0,"Tecnología solar ",null,null,null,null,0,null,0," En transmilenio",null,0,"Nunca",0,"No dejo restos de alimentos",0,0,0,0,0]
[null,null,null,null,null,"Calentador a Gas",null,null,0,"Tecnología solar ",null,null,null,null,0,null,0," En transmilenio",null,0,"Nunca",0,"No dejo restos de alimentos",0,0,0,0,0]
[null,null,null,null,null,"Calentador a Gas",null,null,0,"Tecnología solar ",null,null,null,null,0,null,0," En transmilenio",null,0,"Nunca",0,"No dejo restos de alimentos",0,0,0,0,0]
[null,null,null,null,null,"Calentador a Gas",null,null,0,"Tecnología solar ",null,null,null,null,0,null,0," En transmilenio",null,0,"Nunca",0,"No dejo restos de alimentos",0,0,0,0,0]
[null,null,null,null,null,"Calentador a Gas",null,null,0,"Tecnología solar ",null,null,null,null,0,null,0," En transmilenio",null,0,"Nunca",0,"No dejo restos de alimentos",0,0,0,0,0]
[null,null,null,null,null,"Calentador a Gas",null,null,0,"Tecnología solar ",null,null,null,null,0,null,0," En transmilenio",null,0,"Nunca",0,"No dejo restos de alimentos",0,0,0,0,0]
[null,null,null,null,null,"Calentador a Gas",null,null,0,"Tecnología solar ",null,null,null,null,0,null,0," En transmilenio",null,0,"Nunca",0,"No dejo restos de alimentos",0,0,0,0,0]
[null,null,null,null,null,"Calentador a Gas",null,null,0,"Tecnología solar ",null,null,null,null,0,null,0," En transmilenio",null,0,"Nunca",0,"No dejo restos de alimentos",0,0,0,0,0]
[null,null,null,null,null,"Calentador a Gas",null,null,0,"Tecnología solar ",null,null,null,null,0,null,0," En transmilenio",null,0,"Nunca",0,"No dejo restos de alimentos",0,0,0,0,0]
[null,null,null,null,null,"Calentador a Gas",null,null,0,"Tecnología solar ",null,null,null,null,0,null,0," En transmilenio",null,0,"Nunca",0,"No dejo restos de alimentos",0,0,0,0,0]
[null,null,null,null,null,"Calentador a Gas",null,null,0,"Tecnología solar ",null,null,null,null,0,null,0," En transmilenio",null,0,"Nunca",0,"No dejo restos de alimentos",0,0,0,0,0]
[null,null,null,null,null,"Calentador a Gas",null,null,0,"Tecnología solar ",null,null,null,null,0,null,0," En transmilenio",null,0,"Nunca",0,"No dejo restos de alimentos",0,0,0,0,0]
[null,null,null,null,null,"Calentador a Gas",null,null,0,"Tecnología solar ",null,null,null,null,0,null,0," En transmilenio",null,0,"Nunca",0,"No dejo restos de alimentos",0,0,0,0,0]
[null,null,null,null,null,"Calentador a Gas",null,null,0,"Tecnología solar ",null,null,null,null,0,null,0," En transmilenio",null,0,"Nunca",0,"No dejo restos de alimentos",0,0,0,0,0]
[null,null,null,null,null,"Calentador a Gas",null,null,0,"Tecnología solar ",null,null,null,null,0,null,0," En transmilenio",null,0,"Nunca",0,"No dejo restos de alimentos",0,0,0,0,0]
[null,null,null,null,null,"Calentador a Gas",null,null,0,"Tecnología solar ",null,null,null,null,0,null,0," En transmilenio",null,0,"Nunca",0,"No dejo restos de alimentos",0,0,0,0,0]
[null,null,null,null,null,"Calentador a Gas",null,null,0,"Tecnología solar ",null,null,null,null,0,null,0," En transmilenio",null,0,"Nunca",0,"No dejo restos de alimentos",0,0,0,0,0]
[null,null,null,null,null,"Calentador a Gas",null,null,0,"Tecnología solar ",null,null,null,null,0,null,0," En transmilenio",null,0,"Nunca",0,"No dejo restos de alimentos",0,0,0,0,0]
[null,null,null,null,null,"Calentador a Gas",null,null,0,"Tecnología solar ",null,null,null,null,0,null,0," En transmilenio",null,0,"Nunca",0,"No dejo restos de alimentos",0,0,0,0,0]
[null,null,null,null,null,"Calentador a Gas",null,null,0,"Tecnología solar ",null,null,null,null,0,null,0," En transmilenio",null,0,"Nunca",0,"No dejo restos de alimentos",0,0,0,0,0]
[null,null,null,null,null,"Calentador a Gas",null,null,0,"Tecnología solar ",null,null,null,null,0,null,0," En transmilenio",null,0,"Nunca",0,"No dejo restos de alimentos",0,0,0,0,0]
[null,null,null,null,null,"Calentador a Gas",null,null,0,"Tecnología solar ",null,null,null,null,0,null,0," En transmilenio",null,0,"Nunca",0,"No dejo restos de alimentos",0,0,0,0,0]
[null,null,null,null,null,"Calentador a Gas",null,null,0,"Tecnología solar ",null,null,null,null,0,null,0," En transmilenio",null,0,"Nunca",0,"No dejo restos de alimentos",0,0,0,0,0]
[null,null,null,null,null,"Calentador a Gas",null,null,0,"Tecnología solar ",null,null,null,null,0,null,0," En transmilenio",null,0,"Nunca",0,"No dejo restos de alimentos",0,0,0,0,0]
[null,null,null,null,null,"Calentador a Gas",null,null,0,"Tecnología solar ",null,null,null,null,0,null,0," En transmilenio",null,0,"Nunca",0,"No dejo restos de alimentos",0,0,0,0,0]
[null,null,null,null,null,"Calentador a Gas",null,null,0,"Tecnología solar ",null,null,null,null,0,null,0," En transmilenio",null,0,"Nunca",0,"No dejo restos de alimentos",0,0,0,0,0]
[null,null,null,null,null,"Calentador a Gas",null,null,0,"Tecnología solar ",null,null,null,null,0,null,0," En transmilenio",null,0,"Nunca",0,"No dejo restos de alimentos",0,0,0,0,0]
[null,null,null,null,null,"Calentador a Gas",null,null,0,"Tecnología solar ",null,null,null,null,0,null,0," En transmilenio",null,0,"Nunca",0,"No dejo restos de alimentos",0,0,0,0,0]
[null,null,null,null,null,"Calentador a Gas",null,null,0,"Tecnología solar ",null,null,null,null,0,null,0," En transmilenio",null,0,"Nunca",0,"No dejo restos de alimentos",0,0,0,0,0]
[null,null,null,null,null,"Calentador a Gas",null,null,0,"Tecnología solar ",null,null,null,null,0,null,0," En transmilenio",null,0,"Nunca",0,"No dejo restos de alimentos",0,0,0,0,0]
[null,null,null,null,null,"Calentador a Gas",null,null,0,"Tecnología solar ",null,null,null,null,0,null,0," En transmilenio",null,0,"Nunca",0,"No dejo restos de alimentos",0,0,0,0,0]
[null,null,null,null,null,"Calentador a Gas",null,null,0,"Tecnología solar ",null,null,null,null,0,null,0," En transmilenio",null,0,"Nunca",0,"No dejo restos de alimentos",0,0,0,0,0]
[null,null,null,null,null,"Calentador a Gas",null,null,0,"Tecnología solar ",null,null,null,null,0,null,0," En transmilenio",null,0,"Nunca",0,"No dejo restos de alimentos",0,0,0,0,0]
[null,null,null,null,null,"Calentador a Gas",null,null,0,"Tecnología solar ",null,null,null,null,0,null,0," En transmilenio",null,0,"Nunca",0,"No dejo restos de alimentos",0,0,0,0,0]
[null,null,null,null,null,"Calentador a Gas",null,null,0,"Tecnología solar ",null,null,null,null,0,null,0," En transmilenio",null,0,"Nunca",0,"No dejo restos de alimentos",0,0,0,0,0]
[null,null,null,null,null,"Calentador a Gas",null,null,0,"Tecnología solar ",null,null,null,null,0,null,0," En transmilenio",null,0,"Nunca",0,"No dejo restos de alimentos",0,0,0,0,0]
[null,null,null,null,null,"Calentador a Gas",null,null,0,"Tecnología solar ",null,null,null,null,0,null,0," En transmilenio",null,0,"Nunca",0,"No dejo restos de alimentos",0,0,0,0,0]
[null,null,null,null,null,"Calentador a Gas",null,null,0,"Tecnología solar ",null,null,null,null,0,null,0," En transmilenio",null,0,"Nunca",0,"No dejo restos de alimentos",0,0,0,0,0]
[null,null,null,null,null,"Calentador a Gas",null,null,0,"Tecnología solar ",null,null,null,null,0,null,0," En transmilenio",null,0,"Nunca",0,"No dejo restos de alimentos",0,0,0,0,0]
[null,null,null,null,null,"Calentador a Gas",null,null,0,"Tecnología solar ",null,null,null,null,0,null,0," En transmilenio",null,0,"Nunca",0,"No dejo restos de alimentos",0,0,0,0,0]
[null,null,null,null,null,"Calentador a Gas",null,null,0,"Tecnología solar ",null,null,null,null,0,null,0," En transmilenio",null,0,"Nunca",0,"No dejo restos de alimentos",0,0,0,0,0]
[null,null,null,null,null,"Calentador a Gas",null,null,0,"Tecnología solar ",null,null,null,null,0,null,0," En transmilenio",null,0,"Nunca",0,"No dejo restos de alimentos",0,0,0,0,0]
[null,null,null,null,null,"Calentador a Gas",null,null,0,"Tecnología solar ",null,null,null,null,0,null,0," En transmilenio",null,0,"Nunca",{"$f":"IF(U1410=\"Nunca\",0,IF(U1410=\"3 veces por semana\",\"513\",IF(U1410=\"5 veces por semana\",855,IF(U1410=\"Todos los días\",1197))))","v":0},"No dejo restos de alimentos",0,0,0,0,0]
[null,null,null,null,null,"Calentador a Gas",null,null,{"$f":"IF(F1411=\"Calentador a Gas\",(H1411*1.6*1.98*30),IF(F1411=\"Calentador Eléctrico\",(H1411*1.3*0.199*30),IF(F1411=\"Ducha Eléctrica\",(H1411*4*0.199*30),IF(F1411=\"Ninguno\",\"0\"))))","v":0},"Tecnología solar ",null,null,null,null,{"$f":"IF(J1411=\"Ahorradores \",(K1411*0.02*5*0.199*30),IF(J1411=\"Incandescentes \",(M1411*0.1*5*0.199*30),IF(J1411=\"LED\",(L1411*0.007*5*0.199*30),IF(J1411=\"Tecnología solar \",(N1411*0)))))","v":0},null,{"$f":"P1411*9*0.8312","v":0}," En transmilenio",null,{"$f":"IF(R1411=\"En bicicleta\",(0*S1411),IF(R1411=\"En carro\",(0.218 *S1411),IF(R1411=\"En bus o SITP \",((0.78703*S1411)/40),IF(R1411=\" En transmilenio\",((0.68516*S1411)/140)))))","v":0},"Nunca",0,"No dejo restos de alimentos",0,{"$f":"V1411+T1411+Q1411+O1411+I1411+X1411","v":0},{"$f":"Y1411/1000","v":0},{"$f":"Y1411*12","v":0},0]
[null,null,null,null,null,"Calentador a Gas",null,null,0,"Tecnología solar ",null,null,null,null,0,null,0," En transmilenio",null,0,"Nunca",0,"No dejo restos de alimentos",0,0,0,0,0]
[null,null,null,null,null,"Calentador a Gas",null,null,0,"Tecnología solar ",null,null,null,null,0,null,0," En transmilenio",null,0,"Nunca",0,"No dejo restos de alimentos",{"$f":"IF(W1413=\"No dejo restos de alimentos\",(0),IF(W1413=\"Un cuarto del plato\",(0.25*0.5*0.8312*30),IF(W1413=\"La mitad del plato\",(0.5*0.5*0.8312*30),IF(W1413=\"Tres cuartos del plato\",(0.75*0.5*0.8312*30)))))","v":0},0,0,0,0]
[null,null,null,null,null,"Calentador a Gas",null,null,0,"Tecnología solar ",null,null,null,null,0,null,0," En transmilenio",null,0,"Nunca",0,"No dejo restos de alimentos",0,0,0,0,0]
[null,null,null,null,null,"Calentador a Gas",null,null,0,"Tecnología solar ",null,null,null,null,0,null,0," En transmilenio",null,0,"Nunca",0,"No dejo restos de alimentos",0,0,0,0,0]
[null,null,null,null,null,"Calentador a Gas",null,null,0,"Tecnología solar ",null,null,null,null,0,null,0," En transmilenio",null,0,"Nunca",0,"No dejo restos de alimentos",0,0,0,0,0]
[null,null,null,null,null,"Calentador a Gas",null,null,0,"Tecnología solar ",null,null,null,null,0,null,0," En transmilenio",null,0,"Nunca",0,"No dejo restos de alimentos",0,0,0,0,0]
[null,null,null,null,null,"Calentador a Gas",null,null,0,"Tecnología solar ",null,null,null,null,0,null,0," En transmilenio",null,0,"Nunca",0,"No dejo restos de alimentos",0,0,0,0,0]
[null,null,null,null,null,"Calentador a Gas",null,null,0,"Tecnología solar ",null,null,null,null,0,null,0," En transmilenio",null,0,"Nunca",0,"No dejo restos de alimentos",0,0,0,0,0]
[null,null,null,null,null,"Calentador a Gas",null,null,0,"Tecnología solar ",null,null,null,null,0,null,0," En transmilenio",null,0,"Nunca",0,"No dejo restos de alimentos",0,0,0,0,0]
[null,null,null,null,null,"Calentador a Gas",null,null,0,"Tecnología solar ",null,null,null,null,0,null,0," En transmilenio",null,0,"Nunca",0,"No dejo restos de alimentos",0,0,0,0,0]
[null,null,null,null,null,"Calentador a Gas",null,null,0,"Tecnología solar ",null,null,null,null,0,null,0," En transmilenio",null,0,"Nunca",0,"No dejo restos de alimentos",0,0,0,0,0]
[null,null,null,null,null,"Calentador a Gas",null,null,0,"Tecnología solar ",null,null,null,null,0,null,0," En transmilenio",null,0,"Nunca",0,"No dejo restos de alimentos",0,0,0,0,0]
[null,null,null,null,null,"Calentador a Gas",null,null,0,"Tecnología solar ",null,null,null,null,0,null,0," En transmilenio",null,0,"Nunca",0,"No dejo restos de alimentos",0,0,0,0,0]
[null,null,null,null,null,"Calentador a Gas",null,null,0,"Tecnología solar ",null,null,null,null,0,null,0," En transmilenio",null,0,"Nunca",0,"No dejo restos de alimentos",0,0,0,0,0]
[null,null,null,null,null,"Calentador a Gas",null,null,0,"Tecnología solar ",null,null,null,null,0,null,0," En transmilenio",null,0,"Nunca",0,"No dejo restos de alimentos",0,0,0,0,0]
[null,null,null,null,null,"Calentador a Gas",null,null,0,"Tecnología solar ",null,null,null,null,0,null,0," En transmilenio",null,0,"Nunca",0,"No dejo restos de alimentos",0,0,0,0,0]
[null,null,null,null,null,"Calentador a Gas",null,null,0,"Tecnología solar ",null,null,null,null,0,null,0," En transmilenio",null,0,"Nunca",0,"No dejo restos de alimentos",0,0,0,0,0]
[null,null,null,null,null,"Calentador a Gas",null,null,0,"Tecnología solar ",null,null,null,null,0,null,0," En transmilenio",null,0,"Nunca",0,"No dejo restos de alimentos",0,0,0,0,0]
[null,null,null,null,null,"Calentador a Gas",null,null,0,"Tecnología solar ",null,null,null,null,0,null,0," En transmilenio",null,0,"Nunca",0,"No dejo restos de alimentos",0,0,0,0,0]
[null,null,null,null,null,"Calentador a Gas",null,null,0,"Tecnología solar ",null,null,null,null,0,null,0," En transmilenio",null,0,"Nunca",0,"No dejo restos de alimentos",0,0,0,0,0]
[null,null,null,null,null,"Calentador a Gas",null,null,0,"Tecnología solar ",null,null,null,null,0,null,0," En transmilenio",null,0,"Nunca",0,"No dejo restos de alimentos",0,0,0,0,0]
[null,null,null,null,null,"Calentador a Gas",null,null,0,"Tecnología solar ",null,null,null,null,0,null,0," En transmilenio",null,0,"Nunca",0,"No dejo restos de alimentos",0,0,0,0,0]
[null,null,null,null,null,"Calentador a Gas",null,null,0,"Tecnología solar ",null,null,null,null,0,null,0," En transmilenio",null,0,"Nunca",0,"No dejo restos de alimentos",0,0,0,0,0]
[null,null,null,null,null,"Calentador a Gas",null,null,0,"Tecnología solar ",null,null,null,null,0,null,0," En transmilenio",null,0,"Nunca",0,"No dejo restos de alimentos",0,0,0,0,0]
[null,null,null,null,null,"Calentador a Gas",null,null,0,"Tecnología solar ",null,null,null,null,0,null,0," En transmilenio",null,0,"Nunca",0,"No dejo restos de alimentos",0,0,0,0,0]
[null,null,null,null,null,"Calentador a Gas",null,null,0,"Tecnología solar ",null,null,null,null,0,null,0," En transmilenio",null,0,"Nunca",0,"No dejo restos de alimentos",0,0,0,0,0]
[null,null,null,null,null,"Calentador a Gas",null,null,0,"Tecnología solar ",null,null,null,null,0,null,0," En transmilenio",null,0,"Nunca",0,"No dejo restos de alimentos",0,0,0,0,0]
[null,null,null,null,null,"Calentador a Gas",null,null,0,"Tecnología solar ",null,null,null,null,0,null,0," En transmilenio",null,0,"Nunca",0,"No dejo restos de alimentos",0,0,0,0,0]
[null,null,null,null,null,"Calentador a Gas",null,null,0,"Tecnología solar ",null,null,null,null,0,null,0," En transmilenio",null,0,"Nunca",0,"No dejo restos de alimentos",0,0,0,0,0]
[null,null,null,null,null,"Calentador a Gas",null,null,0,"Tecnología solar ",null,null,null,null,0,null,0," En transmilenio",null,0,"Nunca",0,"No dejo restos de alimentos",0,0,0,0,0]
[null,null,null,null,null,"Calentador a Gas",null,null,0,"Tecnología solar ",null,null,null,null,0,null,0," En transmilenio",null,0,"Nunca",0,"No dejo restos de alimentos",0,0,0,0,0]
[null,null,null,null,null,"Calentador a Gas",null,null,0,"Tecnología solar ",null,null,null,null,0,null,0," En transmilenio",null,0,"Nunca",0,"No dejo restos de alimentos",0,0,0,0,0]
[null,null,null,null,null,"Calentador a Gas",null,null,0,"Tecnología solar ",null,null,null,null,0,null,0," En transmilenio",null,0,"Nunca",0,"No dejo restos de alimentos",0,0,0,0,0]
[null,null,null,null,null,"Calentador a Gas",null,null,0,"Tecnología solar ",null,null,null,null,0,null,0," En transmilenio",null,0,"Nunca",0,"No dejo restos de alimentos",0,0,0,0,0]
[null,null,null,null,null,"Calentador a Gas",null,null,0,"Tecnología solar ",null,null,null,null,0,null,0," En transmilenio",null,0,"Nunca",0,"No dejo restos de alimentos",0,0,0,0,0]
[null,null,null,null,null,"Calentador a Gas",null,null,0,"Tecnología solar ",null,null,null,null,0,null,0," En transmilenio",null,0,"Nunca",0,"No dejo restos de alimentos",0,0,0,0,0]
[null,null,null,null,null,"Calentador a Gas",null,null,0,"Tecnología solar ",null,null,null,null,0,null,0," En transmilenio",null,0,"Nunca",0,"No dejo restos de alimentos",0,0,0,0,0]
[null,null,null,null,null,"Calentador a Gas",null,null,0,"Tecnología solar ",null,null,null,null,0,null,0," En transmilenio",null,0,"Nunca",0,"No dejo restos de alimentos",0,0,0,0,0]
[null,null,null,null,null,"Calentador a Gas",null,null,0,"Tecnología solar ",null,null,null,null,0,null,0," En transmilenio",null,0,"Nunca",0,"No dejo restos de alimentos",0,0,0,0,0]
[null,null,null,null,null,"Calentador a Gas",null,null,0,"Tecnología solar ",null,null,null,null,0,null,0," En transmilenio",null,0,"Nunca",0,"No dejo restos de alimentos",0,0,0,0,0]
[null,null,null,null,null,"Calentador a Gas",null,null,0,"Tecnología solar ",null,null,null,null,0,null,0," En transmilenio",null,0,"Nunca",0,"No dejo restos de alimentos",0,0,0,0,0]
[null,null,null,null,null,"Calentador a Gas",null,null,0,"Tecnología solar ",null,null,null,null,0,null,0," En transmilenio",null,0,"Nunca",0,"No dejo restos de alimentos",0,0,0,0,0]
[null,null,null,null,null,"Calentador a Gas",null,null,0,"Tecnología solar ",null,null,null,null,0,null,0," En transmilenio",null,0,"Nunca",0,"No dejo restos de alimentos",0,0,0,0,0]
[null,null,null,null,null,"Calentador a Gas",null,null,0,"Tecnología solar ",null,null,null,null,0,null,0," En transmilenio",null,0,"Nunca",0,"No dejo restos de alimentos",0,0,0,0,0]
[null,null,null,null,null,"Calentador a Gas",null,null,0,"Tecnología solar ",null,null,null,null,0,null,0," En transmilenio",null,0,"Nunca",0,"No dejo restos de alimentos",0,0,0,0,0]
[null,null,null,null,null,"Calentador a Gas",null,null,0,"Tecnología solar ",null,null,null,null,0,null,0," En transmilenio",null,0,"Nunca",0,"No dejo restos de alimentos",0,0,0,0,0]
[null,null,null,null,null,"Calentador a Gas",null,null,0,"Tecnología solar ",null,null,null,null,0,null,0," En transmilenio",null,0,"Nunca",0,"No dejo restos de alimentos",0,0,0,0,0]
[null,null,null,null,null,"Calentador a Gas",null,null,0,"Tecnología solar ",null,null,null,null,0,null,0," En transmilenio",null,0,"Nunca",0,"No dejo restos de alimentos",0,0,0,0,0]
[null,null,null,null,null,"Calentador a Gas",null,null,0,"Tecnología solar ",null,null,null,null,0,null,0," En transmilenio",null,0,"Nunca",0,"No dejo restos de alimentos",0,0,0,0,0]
[null,null,null,null,null,"Calentador a Gas",null,null,0,"Tecnología solar ",null,null,null,null,0,null,0," En transmilenio",null,0,"Nunca",0,"No dejo restos de alimentos",0,0,0,0,0]
[null,null,null,null,null,"Calentador a Gas",null,null,0,"Tecnología solar ",null,null,null,null,0,null,0," En transmilenio",null,0,"Nunca",0,"No dejo restos de alimentos",0,0,0,0,0]
[null,null,null,null,null,"Calentador a Gas",null,null,0,"Tecnología solar ",null,null,null,null,0,null,0," En transmilenio",null,0,"Nunca",0,"No dejo restos de alimentos",0,0,0,0,0]
[null,null,null,null,null,"Calentador a Gas",null,null,0,"Tecnología solar ",null,null,null,null,0,null,0," En transmilenio",null,0,"Nunca",0,"No dejo restos de alimentos",0,0,0,0,0]
[null,null,null,null,null,"Calentador a Gas",null,null,0,"Tecnología solar ",null,null,null,null,0,null,0," En transmilenio",null,0,"Nunca",0,"No dejo restos de alimentos",0,0,0,0,0]
[null,null,null,null,null,"Calentador a Gas",null,null,0,"Tecnología solar ",null,null,null,null,0,null,0," En transmilenio",null,0,"Nunca",0,"No dejo restos de alimentos",0,0,0,0,0]
[null,null,null,null,null,"Calentador a Gas",null,null,0,"Tecnología solar ",null,null,null,null,0,null,0," En transmilenio",null,0,"Nunca",0,"No dejo restos de alimentos",0,0,0,0,0]
[null,null,null,null,null,"Calentador a Gas",null,null,0,"Tecnología solar ",null,null,null,null,0,null,0," En transmilenio",null,0,"Nunca",0,"No dejo restos de alimentos",0,0,0,0,0]
[null,null,null,null,null,"Calentador a Gas",null,null,0,"Tecnología solar ",null,null,null,null,0,null,0," En transmilenio",null,0,"Nunca",0,"No dejo restos de alimentos",0,0,0,0,0]
[null,null,null,null,null,"Calentador a Gas",null,null,0,"Tecnología solar ",null,null,null,null,0,null,0," En transmilenio",null,0,"Nunca",0,"No dejo restos de alimentos",0,0,0,0,0]
[null,null,null,null,null,"Calentador a Gas",null,null,0,"Tecnología solar ",null,null,null,null,0,null,0," En transmilenio",null,0,"Nunca",0,"No dejo restos de alimentos",0,0,0,0,0]
[null,null,null,null,null,"Calentador a Gas",null,null,0,"Tecnología solar ",null,null,null,null,0,null,0," En transmilenio",null,0,"Nunca",0,"No dejo restos de alimentos",0,0,0,0,0]
[null,null,null,null,null,"Calentador a Gas",null,null,0,"Tecnología solar ",null,null,null,null,0,null,0," En transmilenio",null,0,"Nunca",0,"No dejo restos de alimentos",0,0,0,0,0]
[null,null,null,null,null,"Calentador a Gas",null,null,0,"Tecnología solar ",null,null,null,null,0,null,0," En transmilenio",null,0,"Nunca",{"$f":"IF(U1474=\"Nunca\",0,IF(U1474=\"3 veces por semana\",\"513\",IF(U1474=\"5 veces por semana\",855,IF(U1474=\"Todos los días\",1197))))","v":0},"No dejo restos de alimentos",0,0,0,0,0]
[null,null,null,null,null,"Calentador a Gas",null,null,{"$f":"IF(F1475=\"Calentador a Gas\",(H1475*1.6*1.98*30),IF(F1475=\"Calentador Eléctrico\",(H1475*1.3*0.199*30),IF(F1475=\"Ducha Eléctrica\",(H1475*4*0.199*30),IF(F1475=\"Ninguno\",\"0\"))))","v":0},"Tecnología solar ",null,null,null,null,{"$f":"IF(J1475=\"Ahorradores \",(K1475*0.02*5*0.199*30),IF(J1475=\"Incandescentes \",(M1475*0.1*5*0.199*30),IF(J1475=\"LED\",(L1475*0.007*5*0.199*30),IF(J1475=\"Tecnología solar \",(N1475*0)))))","v":0},null,{"$f":"P1475*9*0.8312","v":0}," En transmilenio",null,{"$f":"IF(R1475=\"En bicicleta\",(0*S1475),IF(R1475=\"En carro\",(0.218 *S1475),IF(R1475=\"En bus o SITP \",((0.78703*S1475)/40),IF(R1475=\" En transmilenio\",((0.68516*S1475)/140)))))","v":0},"Nunca",0,"No dejo restos de alimentos",0,{"$f":"V1475+T1475+Q1475+O1475+I1475+X1475","v":0},{"$f":"Y1475/1000","v":0},{"$f":"Y1475*12","v":0},0]
[null,null,null,null,null,"Calentador a Gas",null,null,0,"Tecnología solar ",null,null,null,null,0,null,0," En transmilenio",null,0,"Nunca",0,"No dejo restos de alimentos",0,0,0,0,0]
[null,null,null,null,null,"Calentador a Gas",null,null,0,"Tecnología solar ",null,null,null,null,0,null,0," En transmilenio",null,0,"Nunca",0,"No dejo restos de alimentos",{"$f":"IF(W1477=\"No dejo restos de alimentos\",(0),IF(W1477=\"Un cuarto del plato\",(0.25*0.5*0.8312*30),IF(W1477=\"La mitad del plato\",(0.5*0.5*0.8312*30),IF(W1477=\"Tres cuartos del plato\",(0.75*0.5*0.8312*30)))))","v":0},0,0,0,0]
[null,null,null,null,null,"Calentador a Gas",null,null,0,"Tecnología solar ",null,null,null,null,0,null,0," En transmilenio",null,0,"Nunca",0,"No dejo restos de alimentos",0,0,0,0,0]
[null,null,null,null,null,"Calentador a Gas",null,null,0,"Tecnología solar ",null,null,null,null,0,null,0," En transmilenio",null,0,"Nunca",0,"No dejo restos de alimentos",0,0,0,0,0]
[null,null,null,null,null,"Calentador a Gas",null,null,0,"Tecnología solar ",null,null,null,null,0,null,0," En transmilenio",null,0,"Nunca",0,"No dejo restos de alimentos",0,0,0,0,0]
[null,null,null,null,null,"Calentador a Gas",null,null,0,"Tecnología solar ",null,null,null,null,0,null,0," En transmilenio",null,0,"Nunca",0,"No dejo restos de alimentos",0,0,0,0,0]
[null,null,null,null,null,"Calentador a Gas",null,null,0,"Tecnología solar ",null,null,null,null,0,null,0," En transmilenio",null,0,"Nunca",0,"No dejo restos de alimentos",0,0,0,0,0]
[null,null,null,null,null,"Calentador a Gas",null,null,0,"Tecnología solar ",null,null,null,null,0,null,0," En transmilenio",null,0,"Nunca",0,"No dejo restos de alimentos",0,0,0,0,0]
[null,null,null,null,null,"Calentador a Gas",null,null,0,"Tecnología solar ",null,null,null,null,0,null,0," En transmilenio",null,0,"Nunca",0,"No dejo restos de alimentos",0,0,0,0,0]
[null,null,null,null,null,"Calentador a Gas",null,null,0,"Tecnología solar ",null,null,null,null,0,null,0," En transmilenio",null,0,"Nunca",0,"No dejo restos de alimentos",0,0,0,0,0]
[null,null,null,null,null,"Calentador a Gas",null,null,0,"Tecnología solar ",null,null,null,null,0,null,0," En transmilenio",null,0,"Nunca",0,"No dejo restos de alimentos",0,0,0,0,0]
[null,null,null,null,null,"Calentador a Gas",null,null,0,"Tecnología solar ",null,null,null,null,0,null,0," En transmilenio",null,0,"Nunca",0,"No dejo restos de alimentos",0,0,0,0,0]
[null,null,null,null,null,"Calentador a Gas",null,null,0,"Tecnología solar ",null,null,null,null,0,null,0," En transmilenio",null,0,"Nunca",0,"No dejo restos de alimentos",0,0,0,0,0]
[null,null,null,null,null,"Calentador a Gas",null,null,0,"Tecnología solar ",null,null,null,null,0,null,0," En transmilenio",null,0,"Nunca",0,"No dejo restos de alimentos",0,0,0,0,0]
[null,null,null,null,null,"Calentador a Gas",null,null,0,"Tecnología solar ",null,null,null,null,0,null,0," En transmilenio",null,0,"Nunca",0,"No dejo restos de alimentos",0,0,0,0,0]
[null,null,null,null,null,"Calentador a Gas",null,null,0,"Tecnología solar ",null,null,null,null,0,null,0," En transmilenio",null,0,"Nunca",0,"No dejo restos de alimentos",0,0,0,0,0]
[null,null,null,null,null,"Calentador a Gas",null,null,0,"Tecnología solar ",null,null,null,null,0,null,0," En transmilenio",null,0,"Nunca",0,"No dejo restos de alimentos",0,0,0,0,0]
[null,null,null,null,null,"Calentador a Gas",null,null,0,"Tecnología solar ",null,null,null,null,0,null,0," En transmilenio",null,0,"Nunca",0,"No dejo restos de alimentos",0,0,0,0,0]
[null,null,null,null,null,"Calentador a Gas",null,null,0,"Tecnología solar ",null,null,null,null,0,null,0," En transmilenio",null,0,"Nunca",0,"No dejo restos de alimentos",0,0,0,0,0]
[null,null,null,null,null,"Calentador a Gas",null,null,0,"Tecnología solar ",null,null,null,null,0,null,0," En transmilenio",null,0,"Nunca",0,"No dejo restos de alimentos",0,0,0,0,0]
[null,null,null,null,null,"Calentador a Gas",null,null,0,"Tecnología solar ",null,null,null,null,0,null,0," En transmilenio",null,0,"Nunca",0,"No dejo restos de alimentos",0,0,0,0,0]
[null,null,null,null,null,"Calentador a Gas",null,null,0,"Tecnología solar ",null,null,null,null,0,null,0," En transmilenio",null,0,"Nunca",0,"No dejo restos de alimentos",0,0,0,0,0]
[null,null,null,null,null,"Calentador a Gas",null,null,0,"Tecnología solar ",null,null,null,null,0,null,0," En transmilenio",null,0,"Nunca",0,"No dejo restos de alimentos",0,0,0,0,0]
[null,null,null,null,null,"Calentador a Gas",null,null,0,"Tecnología solar ",null,null,null,null,0,null,0," En transmilenio",null,0,"Nunca",0,"No dejo restos de alimentos",0,0,0,0,0]
[null,null,null,null,null,"Calentador a Gas",null,null,0,"Tecnología solar ",null,null,null,null,0,null,0," En transmilenio",null,0,"Nunca",0,"No dejo restos de alimentos",0,0,0,0,0]
[null,null,null,null,null,"Calentador a Gas",null,null,0,"Tecnología solar ",null,null,null,null,0,null,0," En transmilenio",null,0,"Nunca",0,"No dejo restos de alimentos",0,0,0,0,0]
[null,null,null,null,null,"Calentador a Gas",null,null,0,"Tecnología solar ",null,null,null,null,0,null,0," En transmilenio",null,0,"Nunca",0,"No dejo restos de alimentos",0,0,0,0,0]
[null,null,null,null,null,"Calentador a Gas",null,null,0,"Tecnología solar ",null,null,null,null,0,null,0," En transmilenio",null,0,"Nunca",0,"No dejo restos de alimentos",0,0,0,0,0]
[null,null,null,null,null,"Calentador a Gas",null,null,0,"Tecnología solar ",null,null,null,null,0,null,0," En transmilenio",null,0,"Nunca",0,"No dejo restos de alimentos",0,0,0,0,0]
[null,null,null,null,null,"Calentador a Gas",null,null,0,"Tecnología solar ",null,null,null,null,0,null,0," En transmilenio",null,0,"Nunca",0,"No dejo restos de alimentos",0,0,0,0,0]
[null,null,null,null,null,"Calentador a Gas",null,null,0,"Tecnología solar ",null,null,null,null,0,null,0," En transmilenio",null,0,"Nunca",0,"No dejo restos de alimentos",0,0,0,0,0]
[null,null,null,null,null,"Calentador a Gas",null,null,0,"Tecnología solar ",null,null,null,null,0,null,0," En transmilenio",null,0,"Nunca",0,"No dejo restos de alimentos",0,0,0,0,0]
[null,null,null,null,null,"Calentador a Gas",null,null,0,"Tecnología solar ",null,null,null,null,0,null,0," En transmilenio",null,0,"Nunca",0,"No dejo restos de alimentos",0,0,0,0,0]
[null,null,null,null,null,"Calentador a Gas",null,null,0,"Tecnología solar ",null,null,null,null,0,null,0," En transmilenio",null,0,"Nunca",0,"No dejo restos de alimentos",0,0,0,0,0]
[null,null,null,null,null,"Calentador a Gas",null,null,0,"Tecnología solar ",null,null,null,null,0,null,0," En transmilenio",null,0,"Nunca",0,"No dejo restos de alimentos",0,0,0,0,0]
[null,null,null,null,null,"Calentador a Gas",null,null,0,"Tecnología solar ",null,null,null,null,0,null,0," En transmilenio",null,0,"Nunca",0,"No dejo restos de alimentos",0,0,0,0,0]
[null,null,null,null,null,"Calentador a Gas",null,null,0,"Tecnología solar ",null,null,null,null,0,null,0," En transmilenio",null,0,"Nunca",0,"No dejo restos de alimentos",0,0,0,0,0]
[null,null,null,null,null,"Calentador a Gas",null,null,0,"Tecnología solar ",null,null,null,null,0,null,0," En transmilenio",null,0,"Nunca",0,"No dejo restos de alimentos",0,0,0,0,0]
[null,null,null,null,null,"Calentador a Gas",null,null,0,"Tecnología solar ",null,null,null,null,0,null,0," En transmilenio",null,0,"Nunca",0,"No dejo restos de alimentos",0,0,0,0,0]
[null,null,null,null,null,"Calentador a Gas",null,null,0,"Tecnología solar ",null,null,null,null,0,null,0," En transmilenio",null,0,"Nunca",0,"No dejo restos de alimentos",0,0,0,0,0]
[null,null,null,null,null,"Calentador a Gas",null,null,0,"Tecnología solar ",null,null,null,null,0,null,0," En transmilenio",null,0,"Nunca",0,"No dejo restos de alimentos",0,0,0,0,0]
[null,null,null,null,null,"Calentador a Gas",null,null,0,"Tecnología solar ",null,null,null,null,0,null,0," En transmilenio",null,0,"Nunca",0,"No dejo restos de alimentos",0,0,0,0,0]
[null,null,null,null,null,"Calentador a Gas",null,null,0,"Tecnología solar ",null,null,null,null,0,null,0," En transmilenio",null,0,"Nunca",0,"No dejo restos de alimentos",0,0,0,0,0]
[null,null,null,null,null,"Calentador a Gas",null,null,0,"Tecnología solar ",null,null,null,null,0,null,0," En transmilenio",null,0,"Nunca",0,"No dejo restos de alimentos",0,0,0,0,0]
[null,null,null,null,null,"Calentador a Gas",null,null,0,"Tecnología solar ",null,null,null,null,0,null,0," En transmilenio",null,0,"Nunca",0,"No dejo restos de alimentos",0,0,0,0,0]
[null,null,null,null,null,"Calentador a Gas",null,null,0,"Tecnología solar ",null,null,null,null,0,null,0," En transmilenio",null,0,"Nunca",0,"No dejo restos de alimentos",0,0,0,0,0]
[null,null,null,null,null,"Calentador a Gas",null,null,0,"Tecnología solar ",null,null,null,null,0,null,0," En transmilenio",null,0,"Nunca",0,"No dejo restos de alimentos",0,0,0,0,0]
[null,null,null,null,null,"Calentador a Gas",null,null,0,"Tecnología solar ",null,null,null,null,0,null,0," En transmilenio",null,0,"Nunca",0,"No dejo restos de alimentos",0,0,0,0,0]
[null,null,null,null,null,"Calentador a Gas",null,null,0,"Tecnología solar ",null,null,null,null,0,null,0," En transmilenio",null,0,"Nunca",0,"No dejo restos de alimentos",0,0,0,0,0]
[null,null,null,null,null,"Calentador a Gas",null,null,0,"Tecnología solar ",null,null,null,null,0,null,0," En transmilenio",null,0,"Nunca",0,"No dejo restos de alimentos",0,0,0,0,0]
[null,null,null,null,null,"Calentador a Gas",null,null,0,"Tecnología solar ",null,null,null,null,0,null,0," En transmilenio",null,0,"Nunca",0,"No dejo restos de alimentos",0,0,0,0,0]
[null,null,null,null,null,"Calentador a Gas",null,null,0,"Tecnología solar ",null,null,null,null,0,null,0," En transmilenio",null,0,"Nunca",0,"No dejo restos de alimentos",0,0,0,0,0]
[null,null,null,null,null,"Calentador a Gas",null,null,0,"Tecnología solar ",null,null,null,null,0,null,0," En transmilenio",null,0,"Nunca",0,"No dejo restos de alimentos",0,0,0,0,0]
[null,null,null,null,null,"Calentador a Gas",null,null,0,"Tecnología solar ",null,null,null,null,0,null,0," En transmilenio",null,0,"Nunca",0,"No dejo restos de alimentos",0,0,0,0,0]
[null,null,null,null,null,"Calentador a Gas",null,null,0,"Tecnología solar ",null,null,null,null,0,null,0," En transmilenio",null,0,"Nunca",0,"No dejo restos de alimentos",0,0,0,0,0]
[null,null,null,null,null,"Calentador a Gas",null,null,0,"Tecnología solar ",null,null,null,null,0,null,0," En transmilenio",null,0,"Nunca",0,"No dejo restos de alimentos",0,0,0,0,0]
[null,null,null,null,null,"Calentador a Gas",null,null,0,"Tecnología solar ",null,null,null,null,0,null,0," En transmilenio",null,0,"Nunca",0,"No dejo restos de alimentos",0,0,0,0,0]
[null,null,null,null,null,"Calentador a Gas",null,null,0,"Tecnología solar ",null,null,null,null,0,null,0," En transmilenio",null,0,"Nunca",0,"No dejo restos de alimentos",0,0,0,0,0]
[null,null,null,null,null,"Calentador a Gas",null,null,0,"Tecnología solar ",null,null,null,null,0,null,0," En transmilenio",null,0,"Nunca",0,"No dejo restos de alimentos",0,0,0,0,0]
[null,null,null,null,null,"Calentador a Gas",null,null,0,"Tecnología solar ",null,null,null,null,0,null,0," En transmilenio",null,0,"Nunca",0,"No dejo restos de alimentos",0,0,0,0,0]
[null,null,null,null,null,"Calentador a Gas",null,null,0,"Tecnología solar ",null,null,null,null,0,null,0," En transmilenio",null,0,"Nunca",0,"No dejo restos de alimentos",0,0,0,0,0]
[null,null,null,null,null,"Calentador a Gas",null,null,0,"Tecnología solar ",null,null,null,null,0,null,0," En transmilenio",null,0,"Nunca",0,"No dejo restos de alimentos",0,0,0,0,0]
[null,null,null,null,null,"Calentador a Gas",null,null,0,"Tecnología solar ",null,null,null,null,0,null,0," En transmilenio",null,0,"Nunca",{"$f":"IF(U1538=\"Nunca\",0,IF(U1538=\"3 veces por semana\",\"513\",IF(U1538=\"5 veces por semana\",855,IF(U1538=\"Todos los días\",1197))))","v":0},"No dejo restos de alimentos",0,0,0,0,0]
[null,null,null,null,null,"Calentador a Gas",null,null,{"$f":"IF(F1539=\"Calentador a Gas\",(H1539*1.6*1.98*30),IF(F1539=\"Calentador Eléctrico\",(H1539*1.3*0.199*30),IF(F1539=\"Ducha Eléctrica\",(H1539*4*0.199*30),IF(F1539=\"Ninguno\",\"0\"))))","v":0},"Tecnología solar ",null,null,null,null,{"$f":"IF(J1539=\"Ahorradores \",(K1539*0.02*5*0.199*30),IF(J1539=\"Incandescentes \",(M1539*0.1*5*0.199*30),IF(J1539=\"LED\",(L1539*0.007*5*0.199*30),IF(J1539=\"Tecnología solar \",(N1539*0)))))","v":0},null,{"$f":"P1539*9*0.8312","v":0}," En transmilenio",null,{"$f":"IF(R1539=\"En bicicleta\",(0*S1539),IF(R1539=\"En carro\",(0.218 *S1539),IF(R1539=\"En bus o SITP \",((0.78703*S1539)/40),IF(R1539=\" En transmilenio\",((0.68516*S1539)/140)))))","v":0},"Nunca",0,"No dejo restos de alimentos",0,{"$f":"V1539+T1539+Q1539+O1539+I1539+X1539","v":0},{"$f":"Y1539/1000","v":0},{"$f":"Y1539*12","v":0},0]
[null,null,null,null,null,"Calentador a Gas",null,null,0,"Tecnología solar ",null,null,null,null,0,null,0," En transmilenio",null,0,"Nunca",0,"No dejo restos de alimentos",0,0,0,0,0]
[null,null,null,null,null,"Calentador a Gas",null,null,0,"Tecnología solar ",null,null,null,null,0,null,0," En transmilenio",null,0,"Nunca",0,"No dejo restos de alimentos",{"$f":"IF(W1541=\"No dejo restos de alimentos\",(0),IF(W1541=\"Un cuarto del plato\",(0.25*0.5*0.8312*30),IF(W1541=\"La mitad del plato\",(0.5*0.5*0.8312*30),IF(W1541=\"Tres cuartos del plato\",(0.75*0.5*0.8312*30)))))","v":0},0,0,0,0]
[null,null,null,null,null,"Calentador a Gas",null,null,0,"Tecnología solar ",null,null,null,null,0,null,0," En transmilenio",null,0,"Nunca",0,"No dejo restos de alimentos",0,0,0,0,0]
[null,null,null,null,null,"Calentador a Gas",null,null,0,"Tecnología solar ",null,null,null,null,0,null,0," En transmilenio",null,0,"Nunca",0,"No dejo restos de alimentos",0,0,0,0,0]
[null,null,null,null,null,"Calentador a Gas",null,null,0,"Tecnología solar ",null,null,null,null,0,null,0," En transmilenio",null,0,"Nunca",0,"No dejo restos de alimentos",0,0,0,0,0]
[null,null,null,null,null,"Calentador a Gas",null,null,0,"Tecnología solar ",null,null,null,null,0,null,0," En transmilenio",null,0,"Nunca",0,"No dejo restos de alimentos",0,0,0,0,0]
[null,null,null,null,null,"Calentador a Gas",null,null,0,"Tecnología solar ",null,null,null,null,0,null,0," En transmilenio",null,0,"Nunca",0,"No dejo restos de alimentos",0,0,0,0,0]
[null,null,null,null,null,"Calentador a Gas",null,null,0,"Tecnología solar ",null,null,null,null,0,null,0," En transmilenio",null,0,"Nunca",0,"No dejo restos de alimentos",0,0,0,0,0]
[null,null,null,null,null,"Calentador a Gas",null,null,0,"Tecnología solar ",null,null,null,null,0,null,0," En transmilenio",null,0,"Nunca",0,"No dejo restos de alimentos",0,0,0,0,0]
[null,null,null,null,null,"Calentador a Gas",null,null,0,"Tecnología solar ",null,null,null,null,0,null,0," En transmilenio",null,0,"Nunca",0,"No dejo restos de alimentos",0,0,0,0,0]
[null,null,null,null,null,"Calentador a Gas",null,null,0,"Tecnología solar ",null,null,null,null,0,null,0," En transmilenio",null,0,"Nunca",0,"No dejo restos de alimentos",0,0,0,0,0]
[null,null,null,null,null,"Calentador a Gas",null,null,0,"Tecnología solar ",null,null,null,null,0,null,0," En transmilenio",null,0,"Nunca",0,"No dejo restos de alimentos",0,0,0,0,0]
[null,null,null,null,null,"Calentador a Gas",null,null,0,"Tecnología solar ",null,null,null,null,0,null,0," En transmilenio",null,0,"Nunca",0,"No dejo restos de alimentos",0,0,0,0,0]
[2017,null,null,null,null,null,null,null,{"$f":"+SUM(I2:I1552)","v":299.62699999999995},null,null,null,null,null,{"$f":"+SUM(O2:O1552)","v":37.969200000000001},null,{"$f":"+SUM(Q2:Q1552)","v":721.8972},null,null,{"$f":"+SUM(T2:T1552)","v":192.52424999999988},null,{"$f":"+SUM(V2:V1552)","v":2052},null,{"$f":"+SUM(X2:X1552)","v":37.404000000000003},{"$f":"SUM(Y2:Y1552)","v":3854.4216499999998},{"$f":"SUM(Z2:Z1552)","v":3.8544216500000021},46253.05980000001,46.253059799999996]

{"sheet":"FACTORES DE EMISIÓN ","index":5,"n_rows":82,"n_cols":109,"rows_kept":82,"cut":false,"hidden":false,"merged":[[1,104,1,108],[15,106,15,107],[16,106,16,108],[14,106,14,107],[17,106,17,108],[11,106,11,107],[12,106,12,107],[13,106,13,107],[1,89,1,92],[2,73,2,76],[0,8,0,11],[0,13,0,16],[0,17,0,20],[1,73,1,76],[1,78,1,81],[1,84,1,87]]}
[null,null,null,null,null,null,null,null,"FUENTE FIJA",null,null,null,null,"FUENTE MÓVIL"]
["GAS","LIQUIDO","SOLIDO","REFRIGERANTE","AISLANTE","EXTINTOR","ACEITE LUBRICANTE","FUENTE DE EMISIÓN","NOMBRE","FACTOR DE EMISIÓN ","UNIDADES","UNIDAD","FUENTE ","NOMBRE","FACTOR DE EMISIÓN ","UNIDADES","UNIDAD","FUENTE ","NOMBRE MT","UNIDADES","FACTOR DE EMISIÓN","CAPACIDAD DE CARGA",null,"OTRAS FUENTES","UNIDADES","FACTOR DE EMISIÓN","UNIDADES","FC","TRAYECTO","UNIDADES","FACTOR DE EMISIÓN",null,null,"NOMBRE","FACTOR DE EMISIÓN ","UNIDADES",null,"NOMBRE","FACTOR DE EMISIÓN ","UNIDADES",null,2010,null,"NOMBRE","ABSORCIÓN kgCO2eq-20 años","COSTO POR ÁRBOL PLANTADO","ÁRBOLES POR ha","COSTO POR ha",{"$f":"'[3]CONSOLIDADO Y COMPENSACIÓN'!G4","v":2014},{"$f":"AW2+1","v":2015},{"$f":"AX2+1","v":2016},{"$f":"AY2+1","v":2017},{"$f":"AW2","v":2014},{"$f":"BA2+1","v":2015},{"$f":"BB2+1","v":2016},{"$f":"BC2+1","v":2017},{"$f":"BA2","v":2014},{"$f":"BB2","v":2015},{"$f":"BC2","v":2016},{"$f":"BD2","v":2017},null,null,"TIPO DE FUENTE",null,null,null,"TIPO COMBUSTIBLE/REFRIGERANTE/AISLANTE/OTRO",null,null,null,null,"AÑO",null,"ALCANCE 3 - MODO DE TRANSPORTE",null,null,null,null,"ALCANCE 3 - OTRAS FUENTES DE EMISIÓN",null,null,null,null,null,"ALCANCE 3 - VUELOS NACIONALES -",null,null,null,null,"ALCANCE 3 - VUELOS INTERNACIONALES -",null,null,null,null,null,null,null,null,null,null,null,null,null,null,"EVS "]
["Biogás Genérico","Kerosene","Carbón genérico","CFC-11 / R-11","SF6","Extintores CO2","Aceites lubricantes","QUEMADOR","Biogás Genérico",1.857199,"kgCO2eq/m3","m3","FECOC 2016","Gas Natural Cusiana",2.321364,"kgCO2eq/m3","m3","FECOC 2016","A PIE","KM",0,1,null,"PAPEL BOND","MILES DE HOJAS",0.85,"kg CO2 eq / miles de hojas",1000,"BOGOTÁ - ARMENIA - BOGOTÁ","VIAJE",72.95,null,null,"CFC-11 / R-11",null,null,null,null,null,null,null,2011,null,"Roble de tierra fría (Quercus humboldtii) ",280,4950,1600,{"$f":"AU3*AT3","v":7920000},{"$f":"('[3]CONSOLIDADO Y COMPENSACIÓN'!G8)*1000/AS3","v":1050.8988430357142},{"$f":"('[3]CONSOLIDADO Y COMPENSACIÓN'!H8)*1000/AS3","v":927.11021089285714},{"$f":"('[3]CONSOLIDADO Y COMPENSACIÓN'!I8)*1000/AS3","v":561.50946582142865},{"$f":"('[3]CONSOLIDADO Y COMPENSACIÓN'!J8)*1000/AS3","v":0},{"$f":"AW3/1600","v":0.6568117768973214},{"$f":"AX3/1600","v":0.57944388180803574},{"$f":"AY3/1600","v":0.35094341613839292},{"$f":"AZ3/1600","v":0},{"$f":"AW3*4950","v":5201949.2730267849},{"$f":"AX3*4950","v":4589195.5439196425},{"$f":"AY3*4950","v":2779471.8558160719},{"$f":"AZ3*4950","v":0},null,null,"Fuente fija",null,null,null,"Sólido",null,null,null,null,2010,null,"TRANSPORTE URBANO EN BOGOTÁ",null,null,null,"FUENTE ","OTRAS FUENTES","UNIDADES","FACTOR DE EMISIÓN","UNIDADES","FACTOR DE EMISIÓN","FUENTE ","ORIGEN","DESTINO","DISTANCIA (km)","TOTAL KG CO2 PASAJEROS/VIAJE  \n(1 TRAYECTO)","FUENTE ","ORIGEN","DESTINO","DISTANCIA (km)","TOTAL CO2 PASAJEROS/VIAJE  \n(1 TRAYECTO)",null,null,null,null,"NACIONALES "," INTERNACIONALES ","NINGUNO"]
["Coke Gas Genérico","Combustóleo","Carbón Guajira Cesar","CFC-12 / R-12",null,"Extintores R-123 / HCFC-123","Grasas lubricantes","PLANTA ELÉCTRICA","Coke Gas Genérico",0.61381750000000002,"kgCO2eq/m3","m3","FECOC 2016","Gas Natural Guajira",1.9519145,"kgCO2eq/gal","m3","FECOC 2016","BICICLETA","KM",0,1,null,"PAPEL RECICLADO","MILES DE HOJAS",2.42,"kg CO2 eq / miles de hojas",1000,"BOGOTÁ - BARRANCABERMEJA - BOGOTÁ","VIAJE",94.47,null,null,"CFC-12 / R-12",null,null,null,null,null,null,null,2012,null,"Tobo (Escallonia paniculata)",null,null,null,null,null,null,null,null,null,null,null,null,null,null,null,null,null,null,"Fuente móvil",null,null,null,"Líquido",null,null,null,null,2011,null,"NOMBRE MT","UNIDADES","FACTOR DE EMISIÓN (g/km)","CAPACIDAD DE CARGA ","Plan decenal descontaminación de aire ","Papel bond blanco","kg",1.05,"kgCO2 e/kg",1.05,"Silva D., Raymundo A., Oliveira J., Ometto A., 2015. Life cycle assessment of offset paper production in Brazil: hotspots and cleaner production alternatives. Journal of cleaner Production. (93) 222-233","BOGOTÁ, COLOMBIA (BOG)","SAN ANDRÉS ISLAS, COLOMBIA (ADZ)",1207,114.9,"ICAO","BOGOTÁ, COLOMBIA (BOG)","ATLANTA,GA,UNST ( ATL)",3386,185.8,"ICAO",null,null,null,"SAN ANDRÉS ISLAS, COLOMBIA (ADZ)","ATLANTA,GA,UNST ( ATL)",null,null,null,null,null,"En bicicleta","Calentador a Gas","Ahorradores ","5 veces por semana","No dejo restos de alimentos"]
["Gas Natural Cusiana","Crudo de Castilla","Carbón Guajira","HCFC-22 / R-22",null,null,null,"MONTACARGA","Gas Natural Cusiana",2.1931170999999998,"kgCO2eq /m3","m3","FECOC 2016","Gas Natural Guepaje",1.9371465999999999,"kgCO2eq /m3","m3","FECOC 2016","MOTOCICLETA","KM",33.11,1,null,"TRATAMIENTO DE VERTIMIENTOS","KG",4.7300000000000004,"kg CO2 eq / kg",1000,"BOGOTÁ - BARRANQUILLA - BOGOTÁ","VIAJE",177.6,null,null,"HCFC-22 / R-22",null,null,null,null,null,null,null,2013,null,"Aliso (Alnus acuminata)",null,null,null,null,null,null,null,null,null,null,null,null,null,null,null,null,null,null,null,null,null,null,"Gaseoso",null,null,null,null,2012,null,"Motocicleta 4 tiempos ","km",33.11,1,"Plan decenal descontaminación de aire ","Papel reciclado","kg",0.81,"kgCO2 e/kg",0.81,"European reference Lifecycle Database:  Graphic Paper; technology mix; production mix, at plant; 79% primary fibre, 21% recycled fibre","BOGOTÁ, COLOMBIA (BOG)","APARTADO,COLOMBIA (APO)",446,82.1,"ICAO","BOGOTÁ, COLOMBIA (BOG)","HAVANA,CUB(AVA)",2216,225.5,"ICAO",null,null,null,"APARTADO,COLOMBIA (APO)","HAVANA,CUB(AVA)",null,null,null,null,null,"En bus o SITP ","Calentador Eléctrico","Incandescentes ","3 veces por semana","Un cuarto del plato"]
["Gas Natural Guajira","Avigas","Carbón Cundinamarca ","HCFC-141B / R-141B",null,null,null,"ESTUFA","Gas Natural Guajira",1.8408125,"kgCO2eq /m3","m3","FECOC 2016","Gas Natural Neiva - Huila",2.1606054000000001,"kgCO2eq /m3","m3","FECOC 2016","SITP","KM",787.03,40,null,"TRATAMIENTO DE LODOS","KG",4.7300000000000004,"kg CO2 eq / kg",1000,"BOGOTÁ - BUCARAMANGA - BOGOTÁ","VIAJE",106.23,null,null,"HCFC-123 / R-123",null,null,null,null,null,null,null,2014,null,"Arrayán (Myrcia popayanensis)",null,null,null,null,null,null,null,null,null,null,null,null,null,null,null,null,null,null,null,null,null,null,"Refrigerante",null,null,null,null,2013,null,"SITP <6000 c.c.","km",787.03,40,"Plan decenal descontaminación de aire ","Papel mate de revista","kg",0.83,"kgCO2 e/kg",0.83,"Leon J., Aliaga C., Boulougouris G., Hortal M., Marti J., 2015. Quantifying GHG emissions savings potential in magazine paper production: a case study on supercalendered and light-weight coated papers. Journal of Cleaner Production. (103) 301-308","BOGOTÁ, COLOMBIA (BOG)","ARAUCA,COLOMBIA (AUC)",459,88.4,"ICAO","BOGOTÁ, COLOMBIA (BOG)","BARCELONA,APAN ( BCN)",8507,403.3,"ICAO",null,null,null,"ARAUCA,COLOMBIA (AUC)","BARCELONA,APAN ( BCN)",null,null,null,null,null," En transmilenio","Ducha Eléctrica","LED","Todos los días","La mitad del plato"]
["Gas Natural Guepaje","Jet A1","Carbón Cauca - Valle del Cauca ","HFC-23 / R-23",null,null,null,"FUENTE MÓVIL","Gas Natural Guepaje",1.8268068999999998,"kgCO2eq /m3","m3","FECOC 2016","Gas Opon Payoa",2.0969355000000003,"kgCO2eq /m3","m3","FECOC 2016","TRANSMILENIO","KM",685.16,160,null,"DISPOSICIÓN DE RESIDUOS EN RELLENO SANITARIO","KG RESIDUOS",12.83,"kg CO2 eq / kg rs",1000,"BOGOTÁ - BUENAVENTURA - BOGOTÁ","VIAJE",93.210000000000008,null,null,"HFC-23 / R-23",null,null,null,null,null,null,null,2015,null,"Mangle (Escallonia pendula)",null,null,null,null,null,null,null,null,null,null,null,null,null,null,null,null,null,null,null,null,null,null,"Aislante",null,null,null,null,2014,null,"Transmilenio","km",685.16,140,"Plan decenal descontaminación de aire ","Papel brillante de revista","kg",1.39,"kgCO2 e/kg",1.39,"Leon J., Aliaga C., Boulougouris G., Hortal M., Marti J., 2015. Quantifying GHG emissions savings potential in magazine paper production: a case study on supercalendered and light-weight coated papers. Journal of Cleaner Production. (103) 301-308","BOGOTÁ, COLOMBIA (BOG)","ARMENIA,COLOMBIA (AXM)",180,28.7,"ICAO",null,null,null,null,"ICAO",null,null,null,"ARMENIA,COLOMBIA (AXM)","BOSTON,MA,UNST (BOS)",null,null,null,null,null,"En carro","Ninguno","Tecnología solar ","Nunca","Tres cuartos del plato"]
["Gas Natural Neiva - Huila","Diesel B10 (Mezcla comercial)","Carbón Norte de Santander ","HFC-32 / R-32",null,null,null,"CUARTO FRIO","Gas Natural Neiva - Huila",2.0370249,"kgCO2eq /m3","m3","FECOC 2016","Gas Cupiagua",2.2899769999999999,"kgCO2eq /m3","m3","FECOC 2016","VEHÍCULO PROPIO","KM",218,1,null,null,null,null,null,null,"BOGOTÁ - CALI - BOGOTÁ","VIAJE",109.35000000000001,null,null,"HFC-32 / R-32",null,null,null,null,null,null,null,2016,null,"Eugenio (Eugenia uniflora)",null,null,null,null,null,null,null,null,null,null,null,null,null,null,null,null,null,null,null,null,null,null,"Extintores",null,null,null,null,2015,null,"Vehículo propio TWC;>1400c.c ","km",218,1,"Plan decenal descontaminación de aire ","Polietileno de alta densidad ","kg",2.87,"kgCO2 e/kg",2.87,"European reference Lifecycle Database Polyethylene high density granulate (PE-HD);production mix, at plant","BOGOTÁ, COLOMBIA (BOG)","BARRANQUILLA.COLOMBIA (BAQ)",690,82.1,"ICAO","BOGOTÁ, COLOMBIA (BOG)","BOSTON,MA,UNST (BOS)",4196,303.5,"ICAO",null,null,null,"BARRANQUILLA.COLOMBIA (BAQ)","CARACAS,VENZ, (CCS)"]
["Gas Opon Payoa","Biodiesel palma","Carbón Córdoba-Norte de Antioquia ","HFC-125 / R-125",null,null,null,"CALENTADOR","Gas Opon Payoa",1.9789187000000001,"kgCO2eq /m3","m3","FECOC 2016","Gas La Creciente",1.9450425000000002,"kgCO2eq /m3","m3","FECOC 2016",null,null,null,null,null,null,null,null,null,null,"BOGOTÁ - CARTAGENA - BOGOTÁ","VIAJE",172.71,null,null,"HFC-134 / R-134",null,null,null,null,null,null,null,null,null,null,null,null,null,null,null,null,null,null,null,null,null,null,null,null,null,null,null,null,null,null,null,null,null,null,null,null,null,2016,null,null,null,null,null,null,"Polietileno de baja densidad ","kg",2.08,"kgCO2 e/kg",2.08,"European reference Lifecycle Database: Polyethylene low density granulate (PE-LD);production mix, at plant","BOGOTÁ, COLOMBIA (BOG)","BUCARAMNAGA,COLOMBIA (BGA)",288,48.4,"ICAO","BOGOTÁ, COLOMBIA (BOG)","CARACAS,VENZ, (CCS)",1024,114.4,"ICAO",null,null,null,"BUCARAMNAGA,COLOMBIA (BGA)","PARIS,FRAN, (CDG)",null,null,null,null,null,"Residuos solidos a disposición sin categorizar",0.83124719999999985,"kgCO2/kg húmedo","IPCC"]
["Gas Cupiagua","Etanol Anhidro","Carbón Santander ","HFC-134 / R-134",null,null,null,"AIRE ACONDICIONADO","Gas Cupiagua",2.1640682,"kgCO2eq /m3","m3","FECOC 2016","Gas natural Genérico",2.1007949999999997,"kgCO2eq /m3","m3","FECOC 2016","ACPM / DIESEL",null,null,null,null,null,null,null,null,null,"BOGOTÁ - CÚCUTA - BOGOTÁ","VIAJE",129.23000000000002,null,null,"HFC-134a / R-134a",null,null,null,null,null,null,null,null,null,null,null,null,null,null,null,null,null,null,null,null,null,null,null,null,null,null,null,null,null,null,null,null,null,null,null,null,null,2017,null,null,null,null,null,null,"Polipropileno ","kg",2.89,"kgCO2 e/kg",2.89,"European reference Lifecycle Database:  Polypropylene granulate (PP); production mix, at plant","BOGOTÁ, COLOMBIA (BOG)","BUENAVENTURA,COLOMBIA (BUN)",330,36.700000000000003,"ICAO","BOGOTÁ, COLOMBIA (BOG)","PARIS,FRAN, (CDG)",8637,447.9,"ICAO",null,null,null,"BUENAVENTURA,COLOMBIA (BUN)","CANCUN,MEX (CUN)",null,null,null,null,null,"Gas natural Genérico",1.9819536,"kgCO2eq /m3","FECOC"]
["Gas La Creciente","Fuel Oil # 4 - Ecopetrol","Carbón Santander Sogamoso ","HFC-134a / R-134a",null,null,null,"CALDERÍN","Gas La Creciente",1.8338390000000002,"kgCO2eq /m3","m3","FECOC 2016","Gas licuado de petróleo genérico",4.8704833999999995,"kgCO2eq /m3","m3","FECOC 2016","GASOLINA",null,null,null,null,null,null,null,null,null,"BOGOTÁ - FLORENCIA - BOGOTÁ","VIAJE",92.92,null,null,"HFC-143 / R-143",null,null,null,null,null,null,null,null,null,null,null,null,null,null,null,null,null,null,null,null,null,null,null,null,null,null,null,null,null,null,null,null,null,null,null,null,null,2018,null,null,null,null,null,null,"Aluminio primario ","kg",11.1,"kgCO2 e/kg",11.1,"Center for environmental assessment of product and material systems (CPM LCA Database): primary aluminium production","BOGOTÁ, COLOMBIA (BOG)","CALI,COLOMBIA (CLO)",278,46.1,"ICAO","BOGOTÁ, COLOMBIA (BOG)","CANCUN,MEX (CUN)",2276,197,"ICAO",null,null,null,"CALI,COLOMBIA (CLO)","CURACAO,NETS (CUR)",null,null,null,null,null,"Consumo energía eléctrica ",0.19900000000000001,"kgCO2/kWh","UPME "]
["Gas natural Genérico","Gasolina Motor (sin mezcla bioetanol)","Carbón Boyacá ","HFC-143 / R-143",null,null,null,"CALDERA","Gas natural Genérico",1.9819536,"kgCO2eq /m3","m3","FECOC 2016","LPG Propano",5.7335172999999999,"kgCO2eq /m3","m3","FECOC 2016","NO APLICA",null,null,null,null,null,null,null,null,null,"BOGOTÁ - IBAGUÉ - BOGOTÁ","VIAJE",54.41,null,null,"HFC-143a / R-143a",null,null,null,null,null,null,null,null,null,null,null,null,null,null,null,null,null,null,null,null,null,null,null,null,null,null,null,null,null,null,null,null,null,null,null,null,null,2019,null,null,null,null,null,null,"Aluminio reciclado","kg",2.33,"kgCO2 e/kg",2.33,"European reference Lifecycle Database: Aluminium extrusión profile; primary production; production mix, at plant; aluminium semi-finished extrusión product, including primary production, transformation and recycling","BOGOTÁ, COLOMBIA (BOG)","CARTAGENA,COLOMBIA (CTG)",653,77.2,"ICAO","BOGOTÁ, COLOMBIA (BOG)","CURACAO,NETS (CUR)",1007,131.80000000000001,"ICAO",null,null,null,"CARTAGENA,COLOMBIA (CTG)","CUZCO,PERU (CUZ)",null,null,null,null,null,"Potenacia Bombillo LED","7Kw"]
["Gas licuado de petróleo genérico","Diesel Marino","Carbón Antioquia ","HFC-143a / R-143a",null,null,null,"FLAMEADOR","Gas licuado de petróleo genérico",4.6974011000000004,"kgCO2eq /m3","m3","FECOC 2016","Gas Natural Sebastapol",2.0618810000000001,"kgCO2eq /m3","m3","FECOC 2016",null,null,null,null,null,null,null,null,null,null,"BOGOTÁ - LETICIA - BOGOTÁ","VIAJE",292.25,null,null,"HFC-407C / R-407C",null,null,null,null,null,null,null,null,null,null,null,null,null,null,null,null,null,null,null,null,null,null,null,null,null,null,null,null,null,null,null,null,null,null,null,null,null,2020,null,null,null,null,null,null,"Vertimientos industriales no tratados (solo para alcance 3)","kg DQO",{"$f":"0.25*0.1","v":2.5000000000000001E-2},"kgCO2/kg DQO",{"$f":"CC13*28","v":0.70000000000000007},"IPCC 2006","BOGOTÁ, COLOMBIA (BOG)","CUCUTA,COLOMBIA (CUC)",399,60.5,"ICAO","BOGOTÁ, COLOMBIA (BOG)","CUZCO,PERU (CUZ)",2041,189.5,"ICAO",null,null,null,"CUCUTA,COLOMBIA (CUC)","DALLAS,TX,UNST (DFW)",null,null,null,null,null,"Potencia bombillo incandescente","100Kw"]
["LPG Propano","Diesel B2o ACPM (sin mezcla biodiesel)","Bagazo","HFC-227ea / FM-200",null,null,null,"HORNO","LPG Propano",5.5836953999999999,"kgCO2eq /m3","m3","FECOC 2016","Gas Natural Usme",2.2265914000000002,"kgCO2eq /m3","m3","FECOC 2016",null,null,null,null,null,null,null,null,null,null,"BOGOTÁ - MANIZALES - BOGOTÁ","VIAJE",73.550000000000011,null,null,"HFC-410a / R-410a",null,null,null,null,null,null,null,null,null,null,null,null,null,null,null,null,null,null,null,null,null,null,null,null,null,null,null,null,null,null,null,null,null,null,null,null,null,2021,null,null,null,null,null,null,"Vertimientos domésticos no tratados (solo para alcance 3)","kg DBO",0.06,"kgCO2/kg DBO",1.68,"IPCC 2006","BOGOTÁ, COLOMBIA (BOG)","COROZAL,COLOMBIA (CZU)",528,100.6,"ICAO","BOGOTÁ, COLOMBIA (BOG)","DALLAS,TX,UNST (DFW)",3930,287.89999999999998,"ICAO",null,null,null,"COROZAL,COLOMBIA (CZU)","NEW YORK,NY UNST (EWR)",null,null,null,null,null,"Potencia bombillo ahorrador","20Kw"]
["Gas de Pozo Cupiagua","Gasolina E10 (Mezcla Comercial)","Fibra de palma","HFC-404A / R-404A",null,null,null,"INCINERADOR","Gas de Pozo Cupiagua",2.2832233,"kgCO2eq /m3","m3","FECOC 2016","Gas Natural Mariquita",2.3091758000000002,"kgCO2eq /m3","m3","FECOC 2016",null,null,null,null,null,null,null,null,null,null,"BOGOTÁ - MEDELLÍN - BOGOTÁ","VIAJE",110.17,null,null,"HFC-422D / R-422D",null,null,null,null,null,null,null,null,null,null,null,null,null,null,null,null,null,null,null,null,null,null,null,null,null,null,null,null,null,null,null,null,null,null,null,null,null,2022,null,null,null,null,null,null,"Tratamiento de lodos orgánicos industriales","kg DQO",0.2,"kgCO2/kg DQO",5.6000000000000005,"IPCC 2006","BOGOTÁ, COLOMBIA (BOG)","BARRANCABERMEJA,COLOMBIA (EJA)",259,49.9,"ICAO","BOGOTÁ, COLOMBIA (BOG)","NEW YORK,NY UNST (EWR)",3999,264,"ICAO",null,null,null,"BARRANCABERMEJA,COLOMBIA (EJA)","BUENOS AIRES,ARGT (EZE)",null,null,null,null,null,"Potencia calentador eléctrico","1,3  Kw","Ficha técnica calentador eléctrico "]
["Gas Natural Sebastapol",null,"Cuesco de palma","HFC-407C / R-407C",null,null,null,"TURBINA","Gas Natural Sebastapol",1.9439479999999998,"kgCO2eq /m3","m3","FECOC 2016","Diesel B10 (Mezcla comercial)",10.2874582,"kgCO2eq/gal","gal","FECOC 2016",null,null,null,null,null,null,null,null,null,null,"BOGOTÁ - MITÚ - BOGOTÁ","VIAJE",182.47,null,null,"PFC-14 / R-14",null,null,null,null,null,null,null,null,null,null,null,null,null,null,null,null,null,null,null,null,null,null,null,null,null,null,null,null,null,null,null,null,null,null,null,null,null,2023,null,null,null,null,null,null,"Tratamiento de lodos orgánicos domésticos","kg DBO",0.48,"kgCO2/kg DBO",13.44,"IPCC 2006","BOGOTÁ, COLOMBIA (BOG)","MEDELLIN,COLOMBIA (EOH)",232,45.9,"ICAO","BOGOTÁ, COLOMBIA (BOG)","BUENOS AIRES,ARGT (EZE)",4685,291.7,"ICAO",null,null,null,"MEDELLIN,COLOMBIA (EOH)","FORT LAUDERDALE, FL UNST (FLL)",null,null,null,null,null,"Potencia ducha electrica ","4Kw","http://simulador.micodensa.com/index.php/main/viewSimulator"]
["Gas Natural Usme",null,"Raquis de palma","HFC-410a / R-410A",null,null,null,"OTROS","Gas Natural Usme",2.1030248999999999,"kgCO2eq/m3","m3","FECOC 2016","Biodiesel palma",6.8923205999999997,"kgCO2eq/gal","gal","FECOC 2016",null,null,null,null,null,null,null,null,null,null,"BOGOTÁ - MONTERIA - BOGOTÁ","VIAJE",137.66,null,null,"R-290",null,null,null,null,null,null,null,null,null,null,null,null,null,null,null,null,null,null,null,null,null,null,null,null,null,null,null,null,null,null,null,null,null,null,null,null,null,2024,null,null,null,null,null,null,"Residuos solidos a relleno sanitario anaeróbico ","kg húmedo",5.497666666666666E-2,"kgCO2/kg húmedo",1.5393466666666664,"IPCC 2006","BOGOTÁ, COLOMBIA (BOG)","EL YOPAL, COLOMBIA (EYP)",204,31.9,"ICAO","BOGOTÁ, COLOMBIA (BOG)","FORT LAUDERDALE, FL UNST (FLL)",2459,180.5,"ICAO",null,null,null,"EL YOPAL, COLOMBIA (EYP)","FORTALEZA,BRAZ (FOR)",null,null,null,null,null,"Consumo calentador a gas ","18,8 kWh/1,96m3","Ficha técnica calentador de 10L Challenger ,Tabla de factores de conversión gas natural FENOSA"]
["Gas Natural Mariquita",null,"Cascarilla de Arroz","HFC-422D / R-422D",null,null,null,null,"Gas Natural Mariquita",2.1810849999999999,"kgCO2eq /m3","m3","FECOC 2016","Etanol Anhidro",5.9755290999999993,"kgCO2eq/gal","gal","FECOC 2016",null,null,null,null,null,null,null,null,null,null,"BOGOTÁ - NEIVA - BOGOTÁ","VIAJE",88.51,null,null,"Halon 1301 - CBrF3",null,null,null,null,null,null,null,null,null,null,null,null,null,null,null,null,null,null,null,null,null,null,null,null,null,null,null,null,null,null,null,null,null,null,null,null,null,2025,null,null,null,null,null,null,"Residuos solidos a relleno sanitario semiaerobico ","kg húmedo",2.748833333333333E-2,"kgCO2/kg húmedo",0.76967333333333321,"IPCC 2006","BOGOTÁ, COLOMBIA (BOG)","FLORENCIA, COLOMBIA (FLA)",280,38.299999999999997,"ICAO","BOGOTÁ, COLOMBIA (BOG)","FORTALEZA,BRAZ (FOR)",4064,324.60000000000002,"ICAO",null,null,null,"FLORENCIA, COLOMBIA (FLA)","FRANKFURT, GERM (FRA)",null,null,null,null,null,"Bolsa de 45 cm x 60 cm resiste 9 kg de residuos",null,"http://www.casabestsas.com/index.php/2014-08-15-11-53-00/bolsas-para-la-basura"]
[null,null,"Borra de Café","PFC-14 / R-14 ",null,null,null,null,"Kerosene",9.6253926000000014,"kgCO2eq/gal","gal","FECOC 2016","Gasolina Motor (sin mezcla bioetanol)",8.8242188000000006,"kgCO2eq/gal","gal","FECOC 2016",null,null,null,null,null,null,null,null,null,null,"BOGOTÁ - PASTO - BOGOTÁ","VIAJE",137.59,null,null,"SF6",null,null,null,null,null,null,null,null,null,null,null,null,null,null,null,null,null,null,null,null,null,null,null,null,null,null,null,null,null,null,null,null,null,null,null,null,null,2026,null,null,null,null,null,null,"Residuos solidos a botadero >5mts profundidad","kg húmedo",3.9583199999999999E-2,"kgCO2/kg húmedo",1.1083296,"IPCC 2006","BOGOTÁ, COLOMBIA (BOG)","IBAGUE,COLOMBIA(IBE)",114,13.9,"ICAO","BOGOTÁ, COLOMBIA (BOG)","FRANKFURT, GERM (FRA)",9080,486.7,"ICAO",null,null,null,"IBAGUE,COLOMBIA(IBE)","RIO DE JANEIRO, BRAZ (GIG)"]
[null,null,"Cisco de Café","FE-36 / 1,1,1,3,3,3 - Hexafluoropropano",null,null,null,null,"Combustóleo",11.627035599999999,"kgCO2eq/gal","gal","FECOC 2016","Diesel Marino",8.8740410000000001,"kgCO2eq/gal","gal","FECOC 2016",null,null,null,null,null,null,null,null,null,null,"BOGOTÁ - PEREIRA - BOGOTÁ","VIAJE",79.3,null,null,"CO2",null,null,null,null,null,null,null,null,null,null,null,null,null,null,null,null,null,null,null,null,null,null,null,null,null,null,null,null,null,null,null,null,null,null,null,null,null,2027,null,null,null,null,null,null,"Residuos solidos a botadero <5mts profundidad","kg húmedo",1.9791599999999999E-2,"kgCO2/kg húmedo",0.55416480000000001,"IPCC 2006","BOGOTÁ, COLOMBIA (BOG)","IPIALES,COLOMBIA (IPI)",579,88,"ICAO","BOGOTÁ, COLOMBIA (BOG)","RIO DE JANEIRO, BRAZ (GIG)",4538,281.39999999999998,"ICAO",null,null,null,"IPIALES,COLOMBIA (IPI)","SAO PAULO, BRAZ (GRU)",null,null,null,null,null,"NOMBRE MT","UNIDADES","FACTOR DE EMISIÓN (g/km)","CAPACIDAD DE CARGA "]
[null,null,"Leña","Propano Alta Calidad / R-290",null,null,null,null,"Crudo de Castilla",11.284264900000002,"kgCO2eq/gal","gal","FECOC 2016","Diesel B2o ACPM (sin mezcla biodiesel)",10.159840999999998,"kgCO2eq/gal","gal","FECOC 2016",null,null,null,null,null,null,null,null,null,null,"BOGOTÁ - POPAYÁN - BOGOTÁ","VIAJE",113.36,null,null,null,null,null,null,null,null,null,null,null,null,null,null,null,null,null,null,null,null,null,null,null,null,null,null,null,null,null,null,null,null,null,null,null,null,null,null,null,null,2028,null,null,null,null,null,null,"Residuos solidos a disposición sin categorizar","kg húmedo",2.9687399999999996E-2,"kgCO2/kg húmedo",0.83124719999999985,"IPCC 2006","BOGOTÁ, COLOMBIA (BOG)","LETICIA,COLOMBIA (LET)",1091,110.8,"ICAO","BOGOTÁ, COLOMBIA (BOG)","SAO PAULO, BRAZ (GRU)",4331,287.3,"ICAO",null,null,null,"LETICIA,COLOMBIA (LET)","GUATEMAL CITY, GUAT (GUA)",null,null,null,null,null,"En bus o SITP ","km",787.03,40]
[null,null,"Madera Genérico","Isobutano / R-600A ",null,null,null,null,"Avigas",6.3889090999999993,"kgCO2eq/gal","gal","FECOC 2016","Gasolina E10 (Mezcla Comercial)",7.6322131000000004,"kgCO2eq/gal","gal","FECOC 2016",null,null,null,null,null,null,null,null,null,null,"BOGOTÁ - PUERTO ASIS - BOGOTÁ","VIAJE",154.09,null,null,null,null,null,null,null,null,null,null,null,null,null,null,null,null,null,null,null,null,null,null,null,null,null,null,null,null,null,null,null,null,null,null,null,null,null,null,null,null,2029,null,null,null,null,null,null,"Lodos aguas residuales a relleno sanitario anaeróbico ","kg húmedo",1.6666666666666666E-2,"kgCO2/kg húmedo",0.46666666666666667,"IPCC 2006",null,null,null,null,"ICAO","BOGOTÁ, COLOMBIA (BOG)","GUATEMAL CITY, GUAT (GUA)",2102,224.7,"ICAO",null,null,null,"MITU,COLOMBIA (MVP)","GUAYAQUIL,ECUAD (GYE)",null,null,null,null,null," En transmilenio","km",685.16,140]
[null,null,"Madera Eucalipto","Halon 1301 / CBrF3",null,null,null,null,"Jet A1",9.8422979000000002,"kgCO2eq/gal","gal","FECOC 2016","CFC-11 / R-11",4660,"kgCO2eq/kg","kg","FECOC 2016",null,null,null,null,null,null,null,null,null,null,"BOGOTÁ - PUERTO CARREÑO - BOGOTÁ","VIAJE",204.68,null,null,null,null,null,null,null,null,null,null,null,null,null,null,null,null,null,null,null,null,null,null,null,null,null,null,null,null,null,null,null,null,null,null,null,null,null,null,null,null,2030,null,null,null,null,null,null,"Residuos solidos hospital a relleno sanitario anaeróbico","kg húmedo",4.9999999999999996E-2,"kgCO2/kg húmedo",1.4,"IPCC 2006","BOGOTÁ, COLOMBIA (BOG)","MITU,COLOMBIA (MVP)",578,104.8,"ICAO","BOGOTÁ, COLOMBIA (BOG)","GUAYAQUIL,ECUAD (GYE)",993,96.6,"ICAO",null,null,null,"MONTERIA,COLOMBIA (MTR)","HAVANA,CUBA (HAV)",null,null,null,null,null,"En carro","km",218,1]
[null,null,"Madera Pino",null,null,null,null,null,"Diesel B10 (Mezcla comercial)",10.278305800000002,"kgCO2eq/gal","gal","FECOC 2016","CFC-12 / R-12",10200,"kgCO2eq/kg","kg","FECOC 2016",null,null,null,null,null,null,null,null,null,null,"BOGOTÁ - PUERTO INIRIDA - BOGOTÁ","VIAJE",200.92,null,null,null,null,null,null,null,null,null,null,null,null,null,null,null,null,null,null,null,null,null,null,null,null,null,null,null,null,null,null,null,null,null,null,null,null,null,null,null,null,2031,null,null,null,null,null,null,"Residuos solidos alimentos a relleno sanitario anaeróbico","kg húmedo",4.9999999999999996E-2,"kgCO2/kg húmedo",1.4,"IPCC 2006","BOGOTÁ, COLOMBIA (BOG)","MONTERIA,COLOMBIA (MTR)",492,65.599999999999994,"ICAO","BOGOTÁ, COLOMBIA (BOG)","HAVANA,CUBA (HAV)",2216,233.5,"ICAO",null,null,null,"MANIZALES,COLOMBIA (MZL)","WASHINTON,DC,UNST (IAD)"]
[null,null,"Madera Acacia",null,null,null,null,null,"Biodiesel palma",2.1408999999999998E-3,"kgCO2eq/gal","gal","FECOC 2016","HCFC-22 / R-22",1760,"kgCO2eq/kg","kg","FECOC 2016",null,null,null,null,null,null,null,null,null,null,"BOGOTÁ - RIOACHA - BOGOTÁ","VIAJE",174.77,null,null,null,null,null,null,null,null,null,null,null,null,null,null,null,null,null,null,null,null,null,null,null,null,null,null,null,null,null,null,null,null,null,null,null,null,null,null,null,null,null,null,null,null,null,null,null,"Residuos solidos textil a relleno sanitario anaeróbico","kg húmedo",7.9999999999999988E-2,"kgCO2/kg húmedo",2.2399999999999998,"IPCC 2006","BOGOTÁ, COLOMBIA (BOG)","MANIZALES,COLOMBIA (MZL)",150,22.1,"ICAO","BOGOTÁ, COLOMBIA (BOG)","WASHINTON,DC,UNST (IAD)",3819,281.3,"ICAO",null,null,null,"NEIVA,COLOMBIA (NVA)","HUSTON,TX,UNST (IAH)",null,null,null,null,null,"Porción de carne diaria ","125g ","https://www.elheraldo.co/entretenimiento/comer-125-gramos-la-porcion-diaria-de-carne-recomendada-292047"]
[null,null,"Madera Melina",null,null,null,null,null,"Etanol Anhidro",1.1773E-3,"kgCO2eq/gal","gal","FECOC 2016","HCFC-141B / R-141B",782,"kgCO2eq/kg","kg","FECOC 2016",null,null,null,null,null,null,null,null,null,null,"BOGOTÁ - SANTA MARTA - BOGOTÁ","VIAJE",192.23000000000002,null,null,null,null,null,null,null,null,null,null,null,null,null,null,null,null,null,null,null,null,null,null,null,null,null,null,null,null,null,null,null,null,null,null,null,null,null,null,null,null,null,null,null,null,null,null,null,"Residuos solidos madera a relleno sanitario anaeróbico","kg húmedo",0.14333333333333331,"kgCO2/kg húmedo",4.0133333333333328,"IPCC 2006","BOGOTÁ, COLOMBIA (BOG)","NEIVA,COLOMBIA (NVA)",232,34.6,"ICAO","BOGOTÁ, COLOMBIA (BOG)","HUSTON,TX,UNST (IAH)",3582,242.4,"ICAO",null,null,null,"PUERTO CARREÑO,COLOMBIA (PCR)","NEW YORK,NY UNST (JFK)",null,null,null,null,null," Consumo de carne Res",342,"kgCO2 /kg"]
[null,null,"Residuos de llantas",null,null,null,null,null,"Fuel Oil # 4 - Ecopetrol",10.180192600000002,"kgCO2eq/gal","gal","FECOC 2016","HFC-23 / R-23",12400,"kgCO2eq/kg","kg","FECOC 2016",null,null,null,null,null,null,null,null,null,null,"BOGOTÁ - VALLEDUPAR - BOGOTÁ","VIAJE",163.80000000000001,null,null,null,null,null,null,null,null,null,null,null,null,null,null,null,null,null,null,null,null,null,null,null,null,null,null,null,null,null,null,null,null,null,null,null,null,null,null,null,null,null,null,null,null,null,null,null,"Residuos solidos pulpa y papel a relleno sanitario anaeróbico","kg húmedo",0.13333333333333333,"kgCO2/kg húmedo",3.7333333333333334,"IPCC 2006","BOGOTÁ, COLOMBIA (BOG)","PUERTO CARREÑO,COLOMBIA (PCR)",753,120.8,"ICAO","BOGOTÁ, COLOMBIA (BOG)","NEW YORK,NY UNST (JFK)",3993,230.3,"ICAO",null,null,null,"PUERTO INIRIDA, COLOMBIA (PDA)","LOS ANGELES,CA,UNST (LAX)",null,null,null,null,null,"La porción de carne corresponde a ¼ del plato por lo que su total se aproxima a 500g "]
[null,null,null,null,null,null,null,null,"Gasolina Motor (sin mezcla bioetanol)",8.8106492999999997,"kgCO2eq/gal","gal","FECOC 2016","HFC-32 / R-32",677,"kgCO2eq/kg","kg","FECOC 2016",null,null,null,null,null,null,null,null,null,null,"BOGOTÁ - VILLAVICENCIO - BOGOTÁ","VIAJE",47.489999999999995,null,null,null,null,null,null,null,null,null,null,null,null,null,null,null,null,null,null,null,null,null,null,null,null,null,null,null,null,null,null,null,null,null,null,null,null,null,null,null,null,null,null,null,null,null,null,null,"Residuos solidos caucho a relleno sanitario anaeróbico","kg húmedo",0.13,"kgCO2/kg húmedo",3.64,"IPCC 2006","BOGOTÁ, COLOMBIA (BOG)","PUERTO INIRIDA, COLOMBIA (PDA)",697,123.2,"ICAO","BOGOTÁ, COLOMBIA (BOG)","LOS ANGELES,CA,UNST (LAX)",5597,288.10000000000002,"ICAO",null,null,null,"PEREIRA,COLOMBIA (PEI)","LONDON,UNRG (LHR)"]
[null,null,null,null,null,null,null,null,"Diesel Marino",8.8649765000000009,"kgCO2eq/gal","gal","FECOC 2016","HFC-125 / R-125",3170,"kgCO2eq/kg","kg","FECOC 2016",null,null,null,null,null,null,null,null,null,null,"BOGOTÁ - YOPAL - BOGOTÁ","VIAJE",83.35,null,null,null,null,null,null,null,null,null,null,null,null,null,null,null,null,null,null,null,null,null,null,null,null,null,null,null,null,null,null,null,null,null,null,null,null,null,null,null,null,null,null,null,null,null,null,null,"Residuos solidos construcción a relleno sanitario anaeróbico","kg húmedo",1.3333333333333332E-2,"kgCO2/kg húmedo",0.37333333333333329,"IPCC 2006","BOGOTÁ, COLOMBIA (BOG)","PEREIRA,COLOMBIA (PEI)",177,32.4,"ICAO","BOGOTÁ, COLOMBIA (BOG)","LONDON,UNRG (LHR)",8468,401.6,"ICAO",null,null,null,"POPAYAN,COLOMBIA(PPN)","LIMA PERU, (LIM)"]
[null,null,null,null,null,null,null,null,"Diesel B2o ACPM (sin mezcla biodiesel)",10.150869999999999,"kgCO2eq/gal","gal","FECOC 2016","HFC-134 / R-134",1120,"kgCO2eq/kg","kg","FECOC 2016",null,null,null,null,null,null,null,null,null,null,null,null,null,null,null,null,null,null,null,null,null,null,null,null,null,null,null,null,null,null,null,null,null,null,null,null,null,null,null,null,null,null,null,null,null,null,null,null,null,null,null,null,null,null,null,null,null,null,null,null,"Residuos solidos otras industrias a relleno sanitario anaeróbico","kg húmedo",3.3333333333333331E-3,"kgCO2/kg húmedo",9.3333333333333324E-2,"IPCC 2006","BOGOTÁ, COLOMBIA (BOG)","POPAYAN,COLOMBIA(PPN)",370,40.799999999999997,"ICAO","BOGOTÁ, COLOMBIA (BOG)","LIMA PERU, (LIM)",1886,150.5,"ICAO",null,null,null,"PASTO,COLOMBIA (PSO)","LA PAZ BOLV (LPB)"]
[null,null,null,null,null,null,null,null,"Gasolina E10 (Mezcla Comercial)",7.6200412000000002,"kgCO2eq/gal","gal","FECOC 2016","HFC-134a / R-134a",1300,"kgCO2eq/kg","kg","FECOC 2016",null,null,null,null,null,null,null,null,null,null,null,null,null,null,null,null,null,null,null,null,null,null,null,null,null,null,null,null,null,null,null,null,null,null,null,null,null,null,null,null,null,null,null,null,null,null,null,null,null,null,null,null,null,null,null,null,null,null,null,null,"Quema a cielo abierto residuos solidos ordinarios","kg res. húmedo",5.6000000000000004E-7,"kgCO2/kg húmedo",1.5680000000000002E-5,"IPCC 2006","BOGOTÁ, COLOMBIA (BOG)","PASTO,COLOMBIA (PSO)",507,79.099999999999994,"ICAO","BOGOTÁ, COLOMBIA (BOG)","LA PAZ BOLV (LPB)",2445,217.4,"ICAO",null,null,null,"PITALITO,COLOMBIA (PTX) ","MADRID,SPAN, (MAD)"]
[null,null,null,null,null,null,null,null,"Carbón genérico",2547.0504916,"kgCO2eq/kg","kg","FECOC 2016","HFC-143 / R-143",328,"kgCO2eq/kg","kg","FECOC 2016",null,null,null,null,null,null,null,null,null,null,null,null,null,null,null,null,null,null,null,null,null,null,null,null,null,null,null,null,null,null,null,null,null,null,null,null,null,null,null,null,null,null,null,null,null,null,null,null,null,null,null,null,null,null,null,null,null,null,null,null,"Incineración controlada residuos solidos ordinarios ","kg res. húmedo",2.3699999999999999E-4,"kgCO2/kg húmedo",6.6359999999999995E-3,"IPCC 2006","BOGOTÁ, COLOMBIA (BOG)","PITALITO,COLOMBIA (PTX) ",383,40,"ICAO","BOGOTÁ, COLOMBIA (BOG)","MADRID,SPAN, (MAD)",8026,420.7,"ICAO",null,null,null,"PUERTO ASIS,COLOMBIA (PUU)","ORLANDO,FL,UNST (MCO)"]
[null,null,null,null,null,null,null,null,"Carbón Guajira Cesar",2172.0828047,"kgCO2eq/kg","kg","FECOC 2016","HFC-143a / R-143a",4800,"kgCO2eq/kg","kg","FECOC 2016",null,null,null,null,null,null,null,null,null,null,null,null,null,null,null,null,null,null,null,null,null,null,null,null,null,null,null,null,null,null,null,null,null,null,null,null,null,null,null,null,null,null,null,null,null,null,null,null,null,null,null,null,null,null,null,null,null,null,null,null,"Incineración controlada residuos solidos industriales ","kg res. húmedo",6.4999999999999997E-3,"kgCO2/kg húmedo",0.182,"IPCC 2006","BOGOTÁ, COLOMBIA (BOG)","PUERTO ASIS,COLOMBIA (PUU)",534,49,"ICAO","BOGOTÁ, COLOMBIA (BOG)","ORLANDO,FL,UNST (MCO)",2741,186.2,"ICAO",null,null,null,"RIOHACHA,COLOMBIA (RCH)","MEXICO,CITY,MEXC (MEX)"]
[null,null,null,null,null,null,null,null,"Carbón Guajira",2907.0013776999999,"kgCO2eq/kg","kg","FECOC 2016","HFC-227ea / FM-200",3350,"kgCO2eq/kg","kg","FECOC 2016",null,null,null,null,null,null,null,null,null,null,null,null,null,null,null,null,null,null,null,null,null,null,null,null,null,null,null,null,null,null,null,null,null,null,null,null,null,null,null,null,null,null,null,null,null,null,null,null,null,null,null,null,null,null,null,null,null,null,null,null,"Incineración controlada residuos solidos hospitalarios  ","kg res. húmedo",5.6000000000000004E-7,"kgCO2/kg húmedo",1.5680000000000002E-5,"IPCC 2006","BOGOTÁ, COLOMBIA (BOG)","RIOHACHA,COLOMBIA (RCH)",769,91.5,"ICAO","BOGOTÁ, COLOMBIA (BOG)","MEXICO,CITY,MEXC (MEX)",3158,246.8,"ICAO",null,null,null,"SAN JOSE DE GUAVIARO, COLOMBIA (SJE)","MIAMI,FL,UNST (MIA)"]
[null,null,null,null,null,null,null,null,"Carbón Cundinamarca ",2226.8699200999999,"kgCO2eq/kg","kg","FECOC 2016","HFC-404A / R-404A",3942.8,"kgCO2eq/kg","kg","FECOC 2016",null,null,null,null,null,null,null,null,null,null,null,null,null,null,null,null,null,null,null,null,null,null,null,null,null,null,null,null,null,null,null,null,null,null,null,null,null,null,null,null,null,null,null,null,null,null,null,null,null,null,null,null,null,null,null,null,null,null,null,null,"Incineración controlada residuos líquidos domésticos","kg res. húmedo",5.6000000000000004E-7,"kgCO2/kg húmedo",1.5680000000000002E-5,"IPCC 2006","BOGOTÁ, COLOMBIA (BOG)","SAN JOSE DE GUAVIARO, COLOMBIA (SJE)",288,32.9,"ICAO","BOGOTÁ, COLOMBIA (BOG)","MIAMI,FL,UNST (MIA)",2432,183.3,"ICAO",null,null,null,"SARAVENA,COLOMBIA (RVE)","MONTEVIDEO,URUG, (MVD)"]
[null,null,null,null,null,null,null,null,"Carbón Cauca - Valle del Cauca ",2520.9138203999996,"kgCO2eq/kg","kg","FECOC 2016","HFC-407C / R-407C",1624.21,"kgCO2eq/kg","kg","FECOC 2016",null,null,null,null,null,null,null,null,null,null,null,null,null,null,null,null,null,null,null,null,null,null,null,null,null,null,null,null,null,null,null,null,null,null,null,null,null,null,null,null,null,null,null,null,null,null,null,null,null,null,null,null,null,null,null,null,null,null,null,null,"Incineración controlada residuos líquidos industriales","kg res. húmedo",9.7000000000000003E-6,"kgCO2/kg húmedo",2.7159999999999999E-4,"IPCC 2006","BOGOTÁ, COLOMBIA (BOG)","SARAVENA,COLOMBIA (RVE)",354,38.200000000000003,"ICAO","BOGOTÁ, COLOMBIA (BOG)","MONTEVIDEO,URUG, (MVD)",4785,370.6,"ICAO",null,null,null,"SANTA MARTA, COLOMBIA (SMR)","PANAM CITY, PANM ( PTY)"]
[null,null,null,null,null,null,null,null,"Carbón Norte de Santander ",2826.0420538999997,"kgCO2eq/kg","kg","FECOC 2016","HFC-410a / R-410A",1923.5,"kgCO2eq/kg","kg","FECOC 2016",null,null,null,null,null,null,null,null,null,null,null,null,null,null,null,null,null,null,null,null,null,null,null,null,null,null,null,null,null,null,null,null,null,null,null,null,null,null,null,null,null,null,null,null,null,null,null,null,null,null,null,null,null,null,null,null,null,null,null,null,"Incineración controlada residuos liquidos fósiles","kg res. húmedo",9.7000000000000003E-6,"kgCO2/kg húmedo",2.7159999999999999E-4,"IPCC 2006","BOGOTÁ, COLOMBIA (BOG)","SANTA MARTA, COLOMBIA (SMR)",713,84.6,"ICAO","BOGOTÁ, COLOMBIA (BOG)","PANAM CITY, PANM ( PTY)",755,96.8,"ICAO",null,null,null,"TUMACO,COLOMBIA (TCO)","PUNTA CANA,DOMR (PUJ)"]
[null,null,null,null,null,null,null,null,"Carbón Córdoba-Norte de Antioquia ",1912.0942038000001,"kgCO2eq/kg","kg","FECOC 2016","HFC-422D / R-422D",2473.2039999999997,"kgCO2eq/kg","kg","FECOC 2016",null,null,null,null,null,null,null,null,null,null,null,null,null,null,null,null,null,null,null,null,null,null,null,null,null,null,null,null,null,null,null,null,null,null,null,null,null,null,null,null,null,null,null,null,null,null,null,null,null,null,null,null,null,null,null,null,null,null,null,null,null,null,null,null,null,null,"BOGOTÁ, COLOMBIA (BOG)","TUMACO,COLOMBIA (TCO)",604,55.9,"ICAO","BOGOTÁ, COLOMBIA (BOG)","PUNTA CANA,DOMR (PUJ)",1664,159.9,"ICAO",null,null,null,"QUIBDO,COLOMBIA (UIB)","SAN SALVADOR,ELSA (SAL)"]
[null,null,null,null,null,null,null,null,"Carbón Santander ",2574.3801226,"kgCO2eq/kg","kg","FECOC 2016","PFC-14 / R-14 ",6630,"kgCO2eq/kg","kg","FECOC 2016",null,null,null,null,null,null,null,null,null,null,null,null,null,null,null,null,null,null,null,null,null,null,null,null,null,null,null,null,null,null,null,null,null,null,null,null,null,null,null,null,null,null,null,null,null,null,null,null,null,null,null,null,null,null,null,null,null,null,null,null,null,null,null,null,null,null,"BOGOTÁ, COLOMBIA (BOG)","QUIBDO,COLOMBIA (UIB)",296,39,"ICAO","BOGOTÁ, COLOMBIA (BOG)","SAN SALVADOR,ELSA (SAL)",1901,186.7,"ICAO",null,null,null,"VILLA GARZON, COLOMBIA (VGZ)","SANTIAGO DE CHILE (SCL)"]
[null,null,null,null,null,null,null,null,"Carbón Santander Sogamoso ",2703.4086130999999,"kgCO2eq/kg","kg","FECOC 2016","FE-36 / 1,1,1,3,3,3 - Hexafluoropropano",182,"kgCO2eq/kg","kg","FECOC 2016",null,null,null,null,null,null,null,null,null,null,null,null,null,null,null,null,null,null,null,null,null,null,null,null,null,null,null,null,null,null,null,null,null,null,null,null,null,null,null,null,null,null,null,null,null,null,null,null,null,null,null,null,null,null,null,null,null,null,null,null,null,null,null,null,null,null,"BOGOTÁ, COLOMBIA (BOG)","VILLA GARZON, COLOMBIA (VGZ)",496,46.8,"ICAO","BOGOTÁ, COLOMBIA (BOG)","SANTIAGO DE CHILE (SCL)",4247,275.60000000000002,"ICAO",null,null,null,"VALLEDUPAR,COLOMBIA (VUP)","SANTO DOMINGO, DOMR (SDQ)"]
[null,null,null,null,null,null,null,null,"Carbón Boyacá ",3067.7752381,"kgCO2eq/kg","kg","FECOC 2016","Propano Alta Calidad / R-290",3,"kgCO2eq/kg","kg","FECOC 2016",null,null,null,null,null,null,null,null,null,null,null,null,null,null,null,null,null,null,null,null,null,null,null,null,null,null,null,null,null,null,null,null,null,null,null,null,null,null,null,null,null,null,null,null,null,null,null,null,null,null,null,null,null,null,null,null,null,null,null,null,null,null,null,null,null,null,"BOGOTÁ, COLOMBIA (BOG)","VALLEDUPAR,COLOMBIA (VUP)",644,79.3,"ICAO","BOGOTÁ, COLOMBIA (BOG)","SANTO DOMINGO, DOMR (SDQ)",1600,155.30000000000001,"ICAO",null,null,null,"VILLAVICENCIO,COLOMBIA (VVC)","SAN JOSE COST, (SJO)"]
[null,null,null,null,null,null,null,null,"Carbón Antioquia ",2287.8334977,"kgCO2eq/kg","kg","FECOC 2016","Isobutano / R-600A ",1,"kgCO2eq/kg","kg","FECOC 2016",null,null,null,null,null,null,null,null,null,null,null,null,null,null,null,null,null,null,null,null,null,null,null,null,null,null,null,null,null,null,null,null,null,null,null,null,null,null,null,null,null,null,null,null,null,null,null,null,null,null,null,null,null,null,null,null,null,null,null,null,null,null,null,null,null,null,"BOGOTÁ, COLOMBIA (BOG)","VILLAVICENCIO,COLOMBIA (VVC)",84,11.3,"ICAO","BOGOTÁ, COLOMBIA (BOG)","SAN JOSE COST, (SJO)",1554,131.1,"ICAO",null,null,null,null,"SAN JUAN, PURI (SJU)"]
[null,null,null,null,null,null,null,null,"Bagazo",28.011602200000002,"kgCO2eq/kg","kg","FECOC 2016","Halon 1301 / CBrF3",6290,"kgCO2eq/kg","kg","FECOC 2016",null,null,null,null,null,null,null,null,null,null,null,null,null,null,null,null,null,null,null,null,null,null,null,null,null,null,null,null,null,null,null,null,null,null,null,null,null,null,null,null,null,null,null,null,null,null,null,null,null,null,null,null,null,null,null,null,null,null,null,null,null,null,null,null,null,null,null,"NINGUNO",null,null,null,"BOGOTÁ, COLOMBIA (BOG)","SAN JUAN, PURI (SJU)",1762,185.1,"ICAO",null,null,null,null,"SALVADOR,BRAZ (SSA)"]
[null,null,null,null,null,null,null,null,"Fibra de palma",31.615438400000002,"kgCO2eq/kg","kg","FECOC 2016","SF6",23500,"kgCO2eq/kg","kg","FECOC 2016",null,null,null,null,null,null,null,null,null,null,null,null,null,null,null,null,null,null,null,null,null,null,null,null,null,null,null,null,null,null,null,null,null,null,null,null,null,null,null,null,null,null,null,null,null,null,null,null,null,null,null,null,null,null,null,null,null,null,null,null,null,null,null,null,null,null,null,null,null,null,null,"BOGOTÁ, COLOMBIA (BOG)","SALVADOR,BRAZ (SSA)",4411,346.9,"ICAO",null,null,null,null,"QUITO,ECUD, (UIO)"]
[null,null,null,null,null,null,null,null,"Cuesco de palma",31.864848300000002,"kgCO2eq/kg","kg","FECOC 2016","Extintores CO2",1,"kgCO2eq/kg","kg","FECOC 2016",null,null,null,null,null,null,null,null,null,null,null,null,null,null,null,null,null,null,null,null,null,null,null,null,null,null,null,null,null,null,null,null,null,null,null,null,null,null,null,null,null,null,null,null,null,null,null,null,null,null,null,null,null,null,null,null,null,null,null,null,null,null,null,null,null,null,null,null,null,null,null,"BOGOTÁ, COLOMBIA (BOG)","QUITO,ECUD, (UIO)",710,86.4,"ICAO",null,null,null,null,"VALENCIA,VENZ (VLN)"]
[null,null,null,null,null,null,null,null,"Raquis de palma",34.765005500000001,"kgCO2eq/kg","kg","FECOC 2016","Extintores R-123 / HCFC-123",79,"kgCO2eq/kg","kg","FECOC 2016",null,null,null,null,null,null,null,null,null,null,null,null,null,null,null,null,null,null,null,null,null,null,null,null,null,null,null,null,null,null,null,null,null,null,null,null,null,null,null,null,null,null,null,null,null,null,null,null,null,null,null,null,null,null,null,null,null,null,null,null,null,null,null,null,null,null,null,null,null,null,null,"BOGOTÁ, COLOMBIA (BOG)","VALENCIA,VENZ (VLN)",912,97,"ICAO",null,null,null,null,"TORONTO,ON,CAND (YYZ)"]
[null,null,null,null,null,null,null,null,"Cascarilla de Arroz",28.410596599999998,"kgCO2eq/kg","kg","FECOC 2016",null,null,null,null,null,null,null,null,null,null,null,null,null,null,null,null,null,null,null,null,null,null,null,null,null,null,null,null,null,null,null,null,null,null,null,null,null,null,null,null,null,null,null,null,null,null,null,null,null,null,null,null,null,null,null,null,null,null,null,null,null,null,null,null,null,null,null,null,null,null,null,null,null,null,null,null,"BOGOTÁ, COLOMBIA (BOG)","TORONTO,ON,CAND (YYZ)",4363,259.89999999999998,"ICAO"]
[null,null,null,null,null,null,null,null,"Borra de Café",44.971791199999998,"kgCO2eq/kg","kg","FECOC 2016","GASEOSOS"]
[null,null,null,null,null,null,null,null,"Cisco de Café",34.059391599999998,"kgCO2eq/kg","kg","FECOC 2016","LIQUIDOS"]
[null,null,null,null,null,null,null,null,"Leña",32.287554999999998,"kgCO2eq/kg","kg","FECOC 2016","REFRIGERANTES",null,null,null,null,null,null,null,null,null,null,null,null,null,null,null,null,null,null,null,null,null,null,null,null,null,null,null,null,null,null,null,null,null,null,null,null,null,null,null,null,null,null,null,null,null,null,null,null,null,null,null,null,null,null,null,null,null,null,null,null,null,null,null,null,null,null,null,null,null,null,"ICAO : https://www.icao.int/environmental-protection/CarbonOffset/Pages/default.aspx"]
[null,null,null,null,null,null,null,null,"Madera Genérico",32.260284399999996,"kgCO2eq/kg","kg","FECOC 2016","AISLANTES"]
[null,null,null,null,null,null,null,null,"Madera Eucalipto",35.129100000000001,"kgCO2eq/kg","kg","FECOC 2016","EXTINTORES"]
[null,null,null,null,null,null,null,null,"Madera Pino",36.0411,"kgCO2eq/kg","kg","FECOC 2016"]
[null,null,null,null,null,null,null,null,"Madera Acacia",35.518599999999999,"kgCO2eq/kg","kg","FECOC 2016"]
[null,null,null,null,null,null,null,null,"Madera Melina",35.305800000000005,"kgCO2eq/kg","kg","FECOC 2016"]
[null,null,null,null,null,null,null,null,"Residuos de llantas",2974.6543280999995,"kgCO2eq/kg","kg","FECOC 2016"]
[null,null,null,null,null,null,null,null,"CFC-11 / R-11",4660,"kgCO2eq/kg","kg","FECOC 2016"]
[null,null,null,null,null,null,null,null,"CFC-12 / R-12",10200,"kgCO2eq /kg","kg","FECOC 2016"]
[null,null,null,null,null,null,null,null,"HCFC-22 / R-22",1760,"kgCO2eq /kg","kg","FECOC 2016"]
[null,null,null,null,null,null,null,null,"HCFC-141B / R-141B",782,"kgCO2eq /kg","kg","FECOC 2016"]
[null,null,null,null,null,null,null,null,"HFC-23 / R-23",12400,"kgCO2eq /kg","kg","FECOC 2016"]
[null,null,null,null,null,null,null,null,"HFC-32 / R-32",677,"kgCO2eq /kg","kg","FECOC 2016"]
[null,null,null,null,null,null,null,null,"HFC-125 / R-125",3170,"kgCO2eq /kg","kg","FECOC 2016"]
[null,null,null,null,null,null,null,null,"HFC-134 / R-134",1120,"kgCO2eq /kg","kg","FECOC 2016"]
[null,null,null,null,null,null,null,null,"HFC-134a / R-134a",1300,"kgCO2eq /kg","kg","FECOC 2016"]
[null,null,null,null,null,null,null,null,"HFC-143 / R-143",328,"kgCO2eq /kg","kg","FECOC 2016"]
[null,null,null,null,null,null,null,null,"HFC-143a / R-143a",4800,"kgCO2eq /kg","kg","FECOC 2016"]
[null,null,null,null,null,null,null,null,"HFC-227ea / FM-200",3350,"kgCO2eq /kg","kg","FECOC 2016"]
[null,null,null,null,null,null,null,null,"HFC-404A / R-404A",3942.8,"kgCO2eq /kg","kg","FECOC 2016"]
[null,null,null,null,null,null,null,null,"HFC-407C / R-407C",1624.21,"kgCO2eq /kg","kg","FECOC 2016"]
[null,null,null,null,null,null,null,null,"HFC-410a / R-410A",1923.5,"kgCO2eq /kg","kg","FECOC 2016"]
[null,null,null,null,null,null,null,null,"HFC-422D / R-422D",2473.2039999999997,"kgCO2eq /kg","kg","FECOC 2016"]
[null,null,null,null,null,null,null,null,"PFC-14 / R-14 ",6630,"kgCO2eq /kg","kg","FECOC 2016"]
[null,null,null,null,null,null,null,null,"FE-36 / 1,1,1,3,3,3 - Hexafluoropropano",182,"kgCO2eq /kg","kg","FECOC 2016"]
[null,null,null,null,null,null,null,null,"Propano Alta Calidad / R-290",3,"kgCO2eq /kg","kg","FECOC 2016"]
[null,null,null,null,null,null,null,null,"Isobutano / R-600A ",1,"kgCO2eq /kg","kg","FECOC 2016"]
[null,null,null,null,null,null,null,null,"Halon 1301 / CBrF3",6290,"kgCO2eq /kg","kg","FECOC 2016"]
[null,null,null,null,null,null,null,null,"SF6",23500,"kgCO2eq /kg","kg","FECOC 2016"]
[null,null,null,null,null,null,null,null,"Extintores CO2",1,"kgCO2eq /kg","kg","FECOC 2016"]
[null,null,null,null,null,null,null,null,"Extintores R-123 / HCFC-123",79,"kgCO2eq /kg","kg","FECOC 2016"]
[null,null,null,null,null,null,null,null,"Aceites lubricantes",1.7829504000000001E-3,"kgCO2eq /gal","gal","FECOC 2016"]
[null,null,null,null,null,null,null,null,"Grasas lubricantes",5.8960000000000002E-4,"kgCO2eq /kg","kg","FECOC 2016"]